BDBM50345495 CHEMBL1784902::P1-(Uridine-5'-)P4-(glucuronic acid-1'-)tetraphosphate
SMILES: O[C@@H]1[C@@H](COP(O)(=O)OP(O)(=O)OP(O)(=O)OP(O)(=O)O[C@H]2O[C@@H]([C@@H](O)[C@H](O)[C@H]2O)C(O)=O)O[C@H]([C@@H]1O)n1ccc(=O)[nH]c1=O
InChI Key: InChIKey=NLYVASMWOWKGJP-LXQIFKJMSA-N
Data: 3 EC50
Activity Spreadsheet -- Enzyme Inhibition Constant Data from BindingDB
Found 3 hits for monomerid = 50345495
Trg + Lig
Ki
nM
ΔG°
kcal/mole
IC50
nM
Kd
nM
EC50/IC50
nM
koff
s-1
kon
M-1s-1
pHTemp
°C
Purinergic receptor P2Y2
(Homo sapiens (Human))
BDBM50345495
(CHEMBL1784902 | P1-(Uridine-5'-)P4-(glucuronic aci...)
Show SMILES O[C@@H]1[C@@H](COP(O)(=O)OP(O)(=O)OP(O)(=O)OP(O)(=O)O[C@H]2O[C@@H]([C@@H](O)[C@H](O)[C@H]2O)C(O)=O)O[C@H]([C@@H]1O)n1ccc(=O)[nH]c1=O |r|
Show InChI InChI=1S/C15H24N2O24P4/c18-5-1-2-17(15(26)16-5)12-9(22)6(19)4(36-12)3-35-42(27,28)39-44(31,32)41-45(33,34)40-43(29,30)38-14-10(23)7(20)8(21)11(37-14)13(24)25/h1-2,4,6-12,14,19-23H,3H2,(H,24,25)(H,27,28)(H,29,30)(H,31,32)(H,33,34)(H,16,18,26)/t4-,6-,7+,8+,9-,10-,11+,12-,14-/m1/s1
Reactome pathway
n/an/an/an/a 490n/an/an/an/a
NIDDK
Curated by ChEMBL
Assay Description
Agonist activity at human recombinant P2Y2 receptor expressed in human 1321N1 cells assessed as [3H]inositol phosphate production after 30 mins by sc...
J Med Chem 54: 4018-33 (2011)
Article DOI: 10.1021/jm101591j
BindingDB Entry DOI: 10.7270/Q22F7NT0
Pyrimidinergic receptor P2Y6
(Homo sapiens (Human))
BDBM50345495
(CHEMBL1784902 | P1-(Uridine-5'-)P4-(glucuronic aci...)
Show SMILES O[C@@H]1[C@@H](COP(O)(=O)OP(O)(=O)OP(O)(=O)OP(O)(=O)O[C@H]2O[C@@H]([C@@H](O)[C@H](O)[C@H]2O)C(O)=O)O[C@H]([C@@H]1O)n1ccc(=O)[nH]c1=O |r|
Show InChI InChI=1S/C15H24N2O24P4/c18-5-1-2-17(15(26)16-5)12-9(22)6(19)4(36-12)3-35-42(27,28)39-44(31,32)41-45(33,34)40-43(29,30)38-14-10(23)7(20)8(21)11(37-14)13(24)25/h1-2,4,6-12,14,19-23H,3H2,(H,24,25)(H,27,28)(H,29,30)(H,31,32)(H,33,34)(H,16,18,26)/t4-,6-,7+,8+,9-,10-,11+,12-,14-/m1/s1
Reactome pathway
n/an/an/an/a 1.65E+3n/an/an/an/a
NIDDK
Curated by ChEMBL
Assay Description
Agonist activity at human recombinant P2Y6 receptor expressed in human 1321N1 cells assessed as [3H]inositol phosphate production after 30 mins by sc...
J Med Chem 54: 4018-33 (2011)
Article DOI: 10.1021/jm101591j
BindingDB Entry DOI: 10.7270/Q22F7NT0
Pyrimidinergic receptor P2Y4
(Homo sapiens (Human))
BDBM50345495
(CHEMBL1784902 | P1-(Uridine-5'-)P4-(glucuronic aci...)
Show SMILES O[C@@H]1[C@@H](COP(O)(=O)OP(O)(=O)OP(O)(=O)OP(O)(=O)O[C@H]2O[C@@H]([C@@H](O)[C@H](O)[C@H]2O)C(O)=O)O[C@H]([C@@H]1O)n1ccc(=O)[nH]c1=O |r|
Show InChI InChI=1S/C15H24N2O24P4/c18-5-1-2-17(15(26)16-5)12-9(22)6(19)4(36-12)3-35-42(27,28)39-44(31,32)41-45(33,34)40-43(29,30)38-14-10(23)7(20)8(21)11(37-14)13(24)25/h1-2,4,6-12,14,19-23H,3H2,(H,24,25)(H,27,28)(H,29,30)(H,31,32)(H,33,34)(H,16,18,26)/t4-,6-,7+,8+,9-,10-,11+,12-,14-/m1/s1
Reactome pathway
n/an/an/an/a 227n/an/an/an/a
NIDDK
Curated by ChEMBL
Assay Description
Agonist activity at human P2Y4
J Med Chem 54: 4018-33 (2011)
Article DOI: 10.1021/jm101591j
BindingDB Entry DOI: 10.7270/Q22F7NT0