BDBM50345529 CHEMBL1784354::N-(1-(4-(4-fluorophenyl)piperazin-1-ylsulfonyl)-2-methylpropan-2-yl)-N-hydroxyformamide
SMILES: CC(C)(CS(=O)(=O)N1CCN(CC1)c1ccc(F)cc1)N(O)C=O
InChI Key: InChIKey=JKTGELXOMXEKJI-UHFFFAOYSA-N
Data: 5 IC50
Activity Spreadsheet -- Enzyme Inhibition Constant Data from BindingDB
Found 5 hits for monomerid = 50345529
Trg + Lig
Ki
nM
ΔG°
kcal/mole
IC50
nM
Kd
nM
EC50/IC50
nM
koff
s-1
kon
M-1s-1
pHTemp
°C
Matrix metalloproteinase-14 (MMP14)
(Homo sapiens (Human))
BDBM50345529
(CHEMBL1784354 | N-(1-(4-(4-fluorophenyl)piperazin-...)
Show SMILES CC(C)(CS(=O)(=O)N1CCN(CC1)c1ccc(F)cc1)N(O)C=O
Show InChI InChI=1S/C15H22FN3O4S/c1-15(2,19(21)12-20)11-24(22,23)18-9-7-17(8-10-18)14-5-3-13(16)4-6-14/h3-6,12,21H,7-11H2,1-2H3
n/an/a 1.40E+3n/an/an/an/an/an/a
AstraZeneca
Curated by ChEMBL
Assay Description
Inhibition of recombinant human MMP-14 assessed as substrate cleavage after 20 hrs by fluorescence assay
Bioorg Med Chem Lett 21: 3301-6 (2011)
Article DOI: 10.1016/j.bmcl.2011.04.028
BindingDB Entry DOI: 10.7270/Q2P55NVH
A disintegrin and metalloproteinase with thrombospondin motifs 4 (ADAMTS-4)
(Homo sapiens (Human))
BDBM50345529
(CHEMBL1784354 | N-(1-(4-(4-fluorophenyl)piperazin-...)
Show SMILES CC(C)(CS(=O)(=O)N1CCN(CC1)c1ccc(F)cc1)N(O)C=O
Show InChI InChI=1S/C15H22FN3O4S/c1-15(2,19(21)12-20)11-24(22,23)18-9-7-17(8-10-18)14-5-3-13(16)4-6-14/h3-6,12,21H,7-11H2,1-2H3
Reactome pathway
n/an/a 92n/an/an/an/an/an/a
AstraZeneca
Curated by ChEMBL
Assay Description
Inhibition of ADAMTS-4 assessed as substrate cleavage after 16 hrs by fluorescence assay
Bioorg Med Chem Lett 21: 3301-6 (2011)
Article DOI: 10.1016/j.bmcl.2011.04.028
BindingDB Entry DOI: 10.7270/Q2P55NVH
Cytochrome P450 3A4
(Homo sapiens (Human))
BDBM50345529
(CHEMBL1784354 | N-(1-(4-(4-fluorophenyl)piperazin-...)
Show SMILES CC(C)(CS(=O)(=O)N1CCN(CC1)c1ccc(F)cc1)N(O)C=O
Show InChI InChI=1S/C15H22FN3O4S/c1-15(2,19(21)12-20)11-24(22,23)18-9-7-17(8-10-18)14-5-3-13(16)4-6-14/h3-6,12,21H,7-11H2,1-2H3
Reactome pathway
n/an/a>1.00E+4n/an/an/an/an/an/a
AstraZeneca
Curated by ChEMBL
Assay Description
Inhibition of CYP3A4
Bioorg Med Chem Lett 21: 3301-6 (2011)
Article DOI: 10.1016/j.bmcl.2011.04.028
BindingDB Entry DOI: 10.7270/Q2P55NVH
Interstitial collagenase
(Homo sapiens (Human))
BDBM50345529
(CHEMBL1784354 | N-(1-(4-(4-fluorophenyl)piperazin-...)
Show SMILES CC(C)(CS(=O)(=O)N1CCN(CC1)c1ccc(F)cc1)N(O)C=O
Show InChI InChI=1S/C15H22FN3O4S/c1-15(2,19(21)12-20)11-24(22,23)18-9-7-17(8-10-18)14-5-3-13(16)4-6-14/h3-6,12,21H,7-11H2,1-2H3
Reactome pathway
n/an/a>1.00E+4n/an/an/an/an/an/a
AstraZeneca
Curated by ChEMBL
Assay Description
Inhibition of recombinant human MMP-1 assessed as substrate cleavage after 20 hrs by fluorescence assay
Bioorg Med Chem Lett 21: 3301-6 (2011)
Article DOI: 10.1016/j.bmcl.2011.04.028
BindingDB Entry DOI: 10.7270/Q2P55NVH
Collagenase 3
(Homo sapiens (Human))
BDBM50345529
(CHEMBL1784354 | N-(1-(4-(4-fluorophenyl)piperazin-...)
Show SMILES CC(C)(CS(=O)(=O)N1CCN(CC1)c1ccc(F)cc1)N(O)C=O
Show InChI InChI=1S/C15H22FN3O4S/c1-15(2,19(21)12-20)11-24(22,23)18-9-7-17(8-10-18)14-5-3-13(16)4-6-14/h3-6,12,21H,7-11H2,1-2H3
NCI pathway
Reactome pathway
n/an/a 1.40E+3n/an/an/an/an/an/a
AstraZeneca
Curated by ChEMBL
Assay Description
Inhibition of recombinant human MMP-13 assessed as substrate cleavage after 20 hrs by fluorescence assay
Bioorg Med Chem Lett 21: 3301-6 (2011)
Article DOI: 10.1016/j.bmcl.2011.04.028
BindingDB Entry DOI: 10.7270/Q2P55NVH