BDBM50345584 5-((5-(4-((4-(2-hydroxyethyl)piperazin-1-yl)methyl)-3-(trifluoromethyl)phenylcarbamoyl)-2-methylphenyl)ethynyl)-1-methyl-1H-imidazole-2-carboxamide::5-[(5-{[4-{[4-(2-hydroxyethyl)piperazin-1-yl]methyl}-3-(trifluoromethyl)phenyl]carbamoyl}-2-methylphenyl)ethynyl]-1-methyl-1H-imidazole-2-carboxamide::CHEMBL1236871
SMILES: Cc1ccc(cc1C#Cc1cnc(C(N)=O)n1C)C(=O)Nc1ccc(CN2CCN(CCO)CC2)c(c1)C(F)(F)F
InChI Key: InChIKey=GOLRXYBFRBKBAG-UHFFFAOYSA-N
Data: 1 IC50
PDB links: 1 PDB ID matches this monomer.
Activity Spreadsheet -- Enzyme Inhibition Constant Data from BindingDB
Found 1 hit for monomerid = 50345584
Trg + Lig
Ki
nM
ΔG°
kcal/mole
IC50
nM
Kd
nM
EC50/IC50
nM
koff
s-1
kon
M-1s-1
pHTemp
°C
Tyrosine-protein kinase ABL1
(Homo sapiens (Human))
BDBM50345584
(5-((5-(4-((4-(2-hydroxyethyl)piperazin-1-yl)methyl...)
Show SMILES Cc1ccc(cc1C#Cc1cnc(C(N)=O)n1C)C(=O)Nc1ccc(CN2CCN(CCO)CC2)c(c1)C(F)(F)F
Show InChI InChI=1S/C29H31F3N6O3/c1-19-3-4-21(15-20(19)6-8-24-17-34-27(26(33)40)36(24)2)28(41)35-23-7-5-22(25(16-23)29(30,31)32)18-38-11-9-37(10-12-38)13-14-39/h3-5,7,15-17,39H,9-14,18H2,1-2H3,(H2,33,40)(H,35,41)
Reactome pathway
n/an/a 3.60n/an/an/an/an/an/a
ARIAD Pharmaceuticals, Inc.
Curated by ChEMBL
Assay Description
Inhibition of wild type human ABL using [EAIYAAPFAKKK] peptide substrate by Hotspot assay
Bioorg Med Chem Lett 21: 3743-8 (2011)
Article DOI: 10.1016/j.bmcl.2011.04.060
BindingDB Entry DOI: 10.7270/Q21G0MM8
3D
3D Structure (crystal)