BDBM50345623 (S)-2-acetamido-3-((S)-2-((2S,3R)-1-((S)-1-amino-1-oxo-3-phenylpropan-2-ylamino)-3-hydroxy-1-oxobutan-2-ylcarbamoyl)pyrrolidin-1-yl)-3-oxopropyl dihydrogen phosphate::CHEMBL1784774
SMILES: C[C@@H](O)[C@H](NC(=O)[C@@H]1CCCN1C(=O)[C@H](COP(O)(O)=O)NC(C)=O)C(=O)N[C@@H](Cc1ccccc1)C(N)=O
InChI Key: InChIKey=JKRMLYVVJPGAFG-RUZYHRDJSA-N
Data: 1 KI  1 IC50
Activity Spreadsheet -- Enzyme Inhibition Constant Data from BindingDB
Found 2 hits for monomerid = 50345623
Trg + Lig
Ki
nM
ΔG°
kcal/mole
IC50
nM
Kd
nM
EC50/IC50
nM
koff
s-1
kon
M-1s-1
pHTemp
°C
Breast cancer type 1 susceptibility protein
(Homo sapiens (Human))
BDBM50345623
((S)-2-acetamido-3-((S)-2-((2S,3R)-1-((S)-1-amino-1...)
Show SMILES C[C@@H](O)[C@H](NC(=O)[C@@H]1CCCN1C(=O)[C@H](COP(O)(O)=O)NC(C)=O)C(=O)N[C@@H](Cc1ccccc1)C(N)=O |r|
Show InChI InChI=1S/C23H34N5O10P/c1-13(29)19(22(33)26-16(20(24)31)11-15-7-4-3-5-8-15)27-21(32)18-9-6-10-28(18)23(34)17(25-14(2)30)12-38-39(35,36)37/h3-5,7-8,13,16-19,29H,6,9-12H2,1-2H3,(H2,24,31)(H,25,30)(H,26,33)(H,27,32)(H2,35,36,37)/t13-,16+,17+,18+,19+/m1/s1
NCI pathway
Reactome pathway
1.85E+3n/an/an/an/an/an/an/an/a
TBA
Curated by ChEMBL
Assay Description
Inhibition of BRCT domain of His-tagged BRCA1 after 1 min by competitive fluorescence polarization assay
ACS Med Chem Lett 2: 764-767 (2011)
Article DOI: 10.1021/ml200147a
BindingDB Entry DOI: 10.7270/Q2WH2R0Q
Breast cancer type 1 susceptibility protein
(Homo sapiens (Human))
BDBM50345623
((S)-2-acetamido-3-((S)-2-((2S,3R)-1-((S)-1-amino-1...)
Show SMILES C[C@@H](O)[C@H](NC(=O)[C@@H]1CCCN1C(=O)[C@H](COP(O)(O)=O)NC(C)=O)C(=O)N[C@@H](Cc1ccccc1)C(N)=O |r|
Show InChI InChI=1S/C23H34N5O10P/c1-13(29)19(22(33)26-16(20(24)31)11-15-7-4-3-5-8-15)27-21(32)18-9-6-10-28(18)23(34)17(25-14(2)30)12-38-39(35,36)37/h3-5,7-8,13,16-19,29H,6,9-12H2,1-2H3,(H2,24,31)(H,25,30)(H,26,33)(H,27,32)(H2,35,36,37)/t13-,16+,17+,18+,19+/m1/s1
NCI pathway
Reactome pathway
n/an/a 4.60E+3n/an/an/an/an/an/a
University of Nebraska Medical Center
Curated by ChEMBL
Assay Description
Inhibition of BRCA1 by fluorescence polarization assay
J Med Chem 54: 4264-8 (2011)
Article DOI: 10.1021/jm1016413
BindingDB Entry DOI: 10.7270/Q2RX9CD3