BDBM50345917 CHEMBL1783857::N-(diaminomethylene)-3-(N-methylsulfamoyl)-4-(1-(4-(2,3,4-trimethoxybenzyl)piperazin-1-yl)ethyl)benzamide hydrochloride
SMILES: CNS(=O)(=O)c1cc(ccc1C(C)N1CCN(Cc2ccc(OC)c(OC)c2OC)CC1)C(=O)NC(N)=N
InChI Key: InChIKey=OATRWXLIZGIISD-UHFFFAOYSA-N
Data: 1 IC50
Activity Spreadsheet -- Enzyme Inhibition Constant Data from BindingDB
Found 1 hit for monomerid = 50345917
Trg + Lig
Ki
nM
ΔG°
kcal/mole
IC50
nM
Kd
nM
EC50/IC50
nM
koff
s-1
kon
M-1s-1
pHTemp
°C
Sodium/hydrogen exchanger 1
(Rattus norvegicus)
BDBM50345917
(CHEMBL1783857 | N-(diaminomethylene)-3-(N-methylsu...)
Show SMILES CNS(=O)(=O)c1cc(ccc1C(C)N1CCN(Cc2ccc(OC)c(OC)c2OC)CC1)C(=O)NC(N)=N
Show InChI InChI=1S/C25H36N6O6S/c1-16(19-8-6-17(24(32)29-25(26)27)14-21(19)38(33,34)28-2)31-12-10-30(11-13-31)15-18-7-9-20(35-3)23(37-5)22(18)36-4/h6-9,14,16,28H,10-13,15H2,1-5H3,(H4,26,27,29,32)
Reactome pathway
n/an/a 4.48n/an/an/an/an/an/a
China Pharmaceutical University
Curated by ChEMBL
Assay Description
Inhibition of NHE1-mediated rat platelet swelling
Bioorg Med Chem Lett 19: 3283-7 (2009)
Article DOI: 10.1016/j.bmcl.2009.04.079
BindingDB Entry DOI: 10.7270/Q2BR8SJ1