BDBM50345921 3-(4-Bromo-phenyl)-9-prop-2-ynylamino-3H-thieno[2,3-d:4,5-d']dipyrimidin-4-one::CHEMBL1784070
SMILES: Brc1ccc(cc1)-n1cnc2c(sc3ncnc(NCC#C)c23)c1=O
InChI Key: InChIKey=KKUDURGNHUAQTM-UHFFFAOYSA-N
Data: 1 KI  2 IC50
Activity Spreadsheet -- Enzyme Inhibition Constant Data from BindingDB
Found 3 hits for monomerid = 50345921
Trg + Lig
Ki
nM
ΔG°
kcal/mole
IC50
nM
Kd
nM
EC50/IC50
nM
koff
s-1
kon
M-1s-1
pHTemp
°C
Metabotropic glutamate receptor
(RAT)
BDBM50345921
(3-(4-Bromo-phenyl)-9-prop-2-ynylamino-3H-thieno[2,...)
Show SMILES Brc1ccc(cc1)-n1cnc2c(sc3ncnc(NCC#C)c23)c1=O
Show InChI InChI=1S/C17H10BrN5OS/c1-2-7-19-15-12-13-14(25-16(12)21-8-20-15)17(24)23(9-22-13)11-5-3-10(18)4-6-11/h1,3-6,8-9H,7H2,(H,19,20,21)
29n/an/an/an/an/an/an/an/a
Schering-Plough Research Institute
Curated by ChEMBL
Assay Description
Antagonist activity at rat mGluR1
Bioorg Med Chem Lett 19: 3199-203 (2009)
Article DOI: 10.1016/j.bmcl.2009.04.104
BindingDB Entry DOI: 10.7270/Q27081SJ
Metabotropic glutamate receptor 1
(Homo sapiens (Human))
BDBM50345921
(3-(4-Bromo-phenyl)-9-prop-2-ynylamino-3H-thieno[2,...)
Show SMILES Brc1ccc(cc1)-n1cnc2c(sc3ncnc(NCC#C)c23)c1=O
Show InChI InChI=1S/C17H10BrN5OS/c1-2-7-19-15-12-13-14(25-16(12)21-8-20-15)17(24)23(9-22-13)11-5-3-10(18)4-6-11/h1,3-6,8-9H,7H2,(H,19,20,21)
n/an/a 6.80n/an/an/an/an/an/a
Schering-Plough Research Institute
Curated by ChEMBL
Assay Description
Antagonist activity at human mGluR1
Bioorg Med Chem Lett 19: 3199-203 (2009)
Article DOI: 10.1016/j.bmcl.2009.04.104
BindingDB Entry DOI: 10.7270/Q27081SJ
Metabotropic glutamate receptor 5
(Homo sapiens (Human))
BDBM50345921
(3-(4-Bromo-phenyl)-9-prop-2-ynylamino-3H-thieno[2,...)
Show SMILES Brc1ccc(cc1)-n1cnc2c(sc3ncnc(NCC#C)c23)c1=O
Show InChI InChI=1S/C17H10BrN5OS/c1-2-7-19-15-12-13-14(25-16(12)21-8-20-15)17(24)23(9-22-13)11-5-3-10(18)4-6-11/h1,3-6,8-9H,7H2,(H,19,20,21)
n/an/a>3.00E+3n/an/an/an/an/an/a
Schering-Plough Research Institute
Curated by ChEMBL
Assay Description
Antagonist activity at human mGluR5
Bioorg Med Chem Lett 19: 3199-203 (2009)
Article DOI: 10.1016/j.bmcl.2009.04.104
BindingDB Entry DOI: 10.7270/Q27081SJ