BDBM50345936 9-Allylamino-3-(4-fluoro-phenyl)-3H-pyrido[3',2':4,5]thieno[3,2-d]pyrimidin-4-one::CHEMBL1783863
SMILES: Fc1ccc(cc1)-n1cnc2c(sc3nccc(NCC=C)c23)c1=O
InChI Key: InChIKey=FONUUVGMXJQRAK-UHFFFAOYSA-N
Data: 1 KI  2 IC50
Activity Spreadsheet -- Enzyme Inhibition Constant Data from BindingDB
Found 3 hits for monomerid = 50345936
Trg + Lig
Ki
nM
ΔG°
kcal/mole
IC50
nM
Kd
nM
EC50/IC50
nM
koff
s-1
kon
M-1s-1
pHTemp
°C
Metabotropic glutamate receptor
(RAT)
BDBM50345936
(9-Allylamino-3-(4-fluoro-phenyl)-3H-pyrido[3',2':4...)
Show SMILES Fc1ccc(cc1)-n1cnc2c(sc3nccc(NCC=C)c23)c1=O
Show InChI InChI=1S/C18H13FN4OS/c1-2-8-20-13-7-9-21-17-14(13)15-16(25-17)18(24)23(10-22-15)12-5-3-11(19)4-6-12/h2-7,9-10H,1,8H2,(H,20,21)
7.70n/an/an/an/an/an/an/an/a
Schering-Plough Research Institute
Curated by ChEMBL
Assay Description
Antagonist activity at rat mGluR1
Bioorg Med Chem Lett 19: 3199-203 (2009)
Article DOI: 10.1016/j.bmcl.2009.04.104
BindingDB Entry DOI: 10.7270/Q27081SJ
Metabotropic glutamate receptor 1
(Homo sapiens (Human))
BDBM50345936
(9-Allylamino-3-(4-fluoro-phenyl)-3H-pyrido[3',2':4...)
Show SMILES Fc1ccc(cc1)-n1cnc2c(sc3nccc(NCC=C)c23)c1=O
Show InChI InChI=1S/C18H13FN4OS/c1-2-8-20-13-7-9-21-17-14(13)15-16(25-17)18(24)23(10-22-15)12-5-3-11(19)4-6-12/h2-7,9-10H,1,8H2,(H,20,21)
n/an/a 4.40n/an/an/an/an/an/a
Schering-Plough Research Institute
Curated by ChEMBL
Assay Description
Antagonist activity at human mGluR1
Bioorg Med Chem Lett 19: 3199-203 (2009)
Article DOI: 10.1016/j.bmcl.2009.04.104
BindingDB Entry DOI: 10.7270/Q27081SJ
Metabotropic glutamate receptor 5
(Homo sapiens (Human))
BDBM50345936
(9-Allylamino-3-(4-fluoro-phenyl)-3H-pyrido[3',2':4...)
Show SMILES Fc1ccc(cc1)-n1cnc2c(sc3nccc(NCC=C)c23)c1=O
Show InChI InChI=1S/C18H13FN4OS/c1-2-8-20-13-7-9-21-17-14(13)15-16(25-17)18(24)23(10-22-15)12-5-3-11(19)4-6-12/h2-7,9-10H,1,8H2,(H,20,21)
n/an/a>3.00E+3n/an/an/an/an/an/a
Schering-Plough Research Institute
Curated by ChEMBL
Assay Description
Antagonist activity at human mGluR5
Bioorg Med Chem Lett 19: 3199-203 (2009)
Article DOI: 10.1016/j.bmcl.2009.04.104
BindingDB Entry DOI: 10.7270/Q27081SJ