BDBM50345944 3-(3-Fluoro-4-methoxy-phenyl)-9-(2-methyl-allylamino)-3H-pyrido[3',2':4,5]thieno[3,2-d]pyrimidin-4-one::CHEMBL1783871
SMILES: COc1ccc(cc1F)-n1cnc2c(sc3nccc(NCC(C)=C)c23)c1=O
InChI Key: InChIKey=WMYDDNATIVVRLS-UHFFFAOYSA-N
Data: 1 KI  2 IC50
Activity Spreadsheet -- Enzyme Inhibition Constant Data from BindingDB
Found 3 hits for monomerid = 50345944
Trg + Lig
Ki
nM
ΔG°
kcal/mole
IC50
nM
Kd
nM
EC50/IC50
nM
koff
s-1
kon
M-1s-1
pHTemp
°C
Metabotropic glutamate receptor
(RAT)
BDBM50345944
(3-(3-Fluoro-4-methoxy-phenyl)-9-(2-methyl-allylami...)
Show SMILES COc1ccc(cc1F)-n1cnc2c(sc3nccc(NCC(C)=C)c23)c1=O
Show InChI InChI=1S/C20H17FN4O2S/c1-11(2)9-23-14-6-7-22-19-16(14)17-18(28-19)20(26)25(10-24-17)12-4-5-15(27-3)13(21)8-12/h4-8,10H,1,9H2,2-3H3,(H,22,23)
13n/an/an/an/an/an/an/an/a
Schering-Plough Research Institute
Curated by ChEMBL
Assay Description
Antagonist activity at rat mGluR1
Bioorg Med Chem Lett 19: 3199-203 (2009)
Article DOI: 10.1016/j.bmcl.2009.04.104
BindingDB Entry DOI: 10.7270/Q27081SJ
Metabotropic glutamate receptor 1
(Homo sapiens (Human))
BDBM50345944
(3-(3-Fluoro-4-methoxy-phenyl)-9-(2-methyl-allylami...)
Show SMILES COc1ccc(cc1F)-n1cnc2c(sc3nccc(NCC(C)=C)c23)c1=O
Show InChI InChI=1S/C20H17FN4O2S/c1-11(2)9-23-14-6-7-22-19-16(14)17-18(28-19)20(26)25(10-24-17)12-4-5-15(27-3)13(21)8-12/h4-8,10H,1,9H2,2-3H3,(H,22,23)
n/an/a 103n/an/an/an/an/an/a
Schering-Plough Research Institute
Curated by ChEMBL
Assay Description
Antagonist activity at human mGluR1
Bioorg Med Chem Lett 19: 3199-203 (2009)
Article DOI: 10.1016/j.bmcl.2009.04.104
BindingDB Entry DOI: 10.7270/Q27081SJ
Metabotropic glutamate receptor 5
(Homo sapiens (Human))
BDBM50345944
(3-(3-Fluoro-4-methoxy-phenyl)-9-(2-methyl-allylami...)
Show SMILES COc1ccc(cc1F)-n1cnc2c(sc3nccc(NCC(C)=C)c23)c1=O
Show InChI InChI=1S/C20H17FN4O2S/c1-11(2)9-23-14-6-7-22-19-16(14)17-18(28-19)20(26)25(10-24-17)12-4-5-15(27-3)13(21)8-12/h4-8,10H,1,9H2,2-3H3,(H,22,23)
n/an/a>3.00E+3n/an/an/an/an/an/a
Schering-Plough Research Institute
Curated by ChEMBL
Assay Description
Antagonist activity at human mGluR5
Bioorg Med Chem Lett 19: 3199-203 (2009)
Article DOI: 10.1016/j.bmcl.2009.04.104
BindingDB Entry DOI: 10.7270/Q27081SJ