BDBM50345951 3-(3-Fluoro-4-methoxy-phenyl)-9-prop-2-ynylamino-3H-pyrido[3',2':4,5]thieno[3,2-d]pyrimidin-4-one::CHEMBL1784050
SMILES: COc1ccc(cc1F)-n1cnc2c(sc3nccc(NCC#C)c23)c1=O
InChI Key: InChIKey=CSZHNKILGMSWKB-UHFFFAOYSA-N
Data: 1 KI  2 IC50
Activity Spreadsheet -- Enzyme Inhibition Constant Data from BindingDB
Found 3 hits for monomerid = 50345951
Trg + Lig
Ki
nM
ΔG°
kcal/mole
IC50
nM
Kd
nM
EC50/IC50
nM
koff
s-1
kon
M-1s-1
pHTemp
°C
Metabotropic glutamate receptor 1
(RAT)
BDBM50345951
(3-(3-Fluoro-4-methoxy-phenyl)-9-prop-2-ynylamino-3...)
Show SMILES COc1ccc(cc1F)-n1cnc2c(sc3nccc(NCC#C)c23)c1=O
Show InChI InChI=1S/C19H13FN4O2S/c1-3-7-21-13-6-8-22-18-15(13)16-17(27-18)19(25)24(10-23-16)11-4-5-14(26-2)12(20)9-11/h1,4-6,8-10H,7H2,2H3,(H,21,22)
28n/an/an/an/an/an/an/an/a
Schering-Plough Research Institute
Curated by ChEMBL
Assay Description
Antagonist activity at rat mGluR1
Bioorg Med Chem Lett 19: 3199-203 (2009)
Article DOI: 10.1016/j.bmcl.2009.04.104
BindingDB Entry DOI: 10.7270/Q27081SJ
Metabotropic glutamate receptor 1
(Homo sapiens (Human))
BDBM50345951
(3-(3-Fluoro-4-methoxy-phenyl)-9-prop-2-ynylamino-3...)
Show SMILES COc1ccc(cc1F)-n1cnc2c(sc3nccc(NCC#C)c23)c1=O
Show InChI InChI=1S/C19H13FN4O2S/c1-3-7-21-13-6-8-22-18-15(13)16-17(27-18)19(25)24(10-23-16)11-4-5-14(26-2)12(20)9-11/h1,4-6,8-10H,7H2,2H3,(H,21,22)
n/an/a 13n/an/an/an/an/an/a
Schering-Plough Research Institute
Curated by ChEMBL
Assay Description
Antagonist activity at human mGluR1
Bioorg Med Chem Lett 19: 3199-203 (2009)
Article DOI: 10.1016/j.bmcl.2009.04.104
BindingDB Entry DOI: 10.7270/Q27081SJ
Metabotropic glutamate receptor 5
(Homo sapiens (Human))
BDBM50345951
(3-(3-Fluoro-4-methoxy-phenyl)-9-prop-2-ynylamino-3...)
Show SMILES COc1ccc(cc1F)-n1cnc2c(sc3nccc(NCC#C)c23)c1=O
Show InChI InChI=1S/C19H13FN4O2S/c1-3-7-21-13-6-8-22-18-15(13)16-17(27-18)19(25)24(10-23-16)11-4-5-14(26-2)12(20)9-11/h1,4-6,8-10H,7H2,2H3,(H,21,22)
n/an/a>3.00E+3n/an/an/an/an/an/a
Schering-Plough Research Institute
Curated by ChEMBL
Assay Description
Antagonist activity at human mGluR5
Bioorg Med Chem Lett 19: 3199-203 (2009)
Article DOI: 10.1016/j.bmcl.2009.04.104
BindingDB Entry DOI: 10.7270/Q27081SJ