BDBM50345964 3-Benzothiazol-5-yl-9-(2-methyl-allylamino)-3H-thieno[2,3-d:4,5-d']dipyrimidin-4-one::CHEMBL1784063
SMILES: CC(=C)CNc1ncnc2sc3c(ncn(-c4ccc5scnc5c4)c3=O)c12
InChI Key: InChIKey=RBLVGJFRSMTPTM-UHFFFAOYSA-N
Data: 1 KI  2 IC50
Activity Spreadsheet -- Enzyme Inhibition Constant Data from BindingDB
Found 3 hits for monomerid = 50345964
Trg + Lig
Ki
nM
ΔG°
kcal/mole
IC50
nM
Kd
nM
EC50/IC50
nM
koff
s-1
kon
M-1s-1
pHTemp
°C
Metabotropic glutamate receptor
(RAT)
BDBM50345964
(3-Benzothiazol-5-yl-9-(2-methyl-allylamino)-3H-thi...)
Show SMILES CC(=C)CNc1ncnc2sc3c(ncn(-c4ccc5scnc5c4)c3=O)c12
Show InChI InChI=1S/C19H14N6OS2/c1-10(2)6-20-17-14-15-16(28-18(14)22-7-21-17)19(26)25(8-23-15)11-3-4-13-12(5-11)24-9-27-13/h3-5,7-9H,1,6H2,2H3,(H,20,21,22)
43n/an/an/an/an/an/an/an/a
Schering-Plough Research Institute
Curated by ChEMBL
Assay Description
Antagonist activity at rat mGluR1
Bioorg Med Chem Lett 19: 3199-203 (2009)
Article DOI: 10.1016/j.bmcl.2009.04.104
BindingDB Entry DOI: 10.7270/Q27081SJ
Metabotropic glutamate receptor 1
(Homo sapiens (Human))
BDBM50345964
(3-Benzothiazol-5-yl-9-(2-methyl-allylamino)-3H-thi...)
Show SMILES CC(=C)CNc1ncnc2sc3c(ncn(-c4ccc5scnc5c4)c3=O)c12
Show InChI InChI=1S/C19H14N6OS2/c1-10(2)6-20-17-14-15-16(28-18(14)22-7-21-17)19(26)25(8-23-15)11-3-4-13-12(5-11)24-9-27-13/h3-5,7-9H,1,6H2,2H3,(H,20,21,22)
n/an/a 16n/an/an/an/an/an/a
Schering-Plough Research Institute
Curated by ChEMBL
Assay Description
Antagonist activity at human mGluR1
Bioorg Med Chem Lett 19: 3199-203 (2009)
Article DOI: 10.1016/j.bmcl.2009.04.104
BindingDB Entry DOI: 10.7270/Q27081SJ
Metabotropic glutamate receptor 5
(Homo sapiens (Human))
BDBM50345964
(3-Benzothiazol-5-yl-9-(2-methyl-allylamino)-3H-thi...)
Show SMILES CC(=C)CNc1ncnc2sc3c(ncn(-c4ccc5scnc5c4)c3=O)c12
Show InChI InChI=1S/C19H14N6OS2/c1-10(2)6-20-17-14-15-16(28-18(14)22-7-21-17)19(26)25(8-23-15)11-3-4-13-12(5-11)24-9-27-13/h3-5,7-9H,1,6H2,2H3,(H,20,21,22)
n/an/a>3.00E+3n/an/an/an/an/an/a
Schering-Plough Research Institute
Curated by ChEMBL
Assay Description
Antagonist activity at human mGluR5
Bioorg Med Chem Lett 19: 3199-203 (2009)
Article DOI: 10.1016/j.bmcl.2009.04.104
BindingDB Entry DOI: 10.7270/Q27081SJ