null
SMILES: O[C@H](CCn1c(nc(C(=O)NCc2ccc(F)c(F)c2)c1C1CC1)-c1ccc(F)cc1)C[C@@H](O)CC([O-])=O
InChI Key: InChIKey=WEDGEZDERPWKAN-WOJBJXKFSA-M
Activity Spreadsheet -- Enzyme Inhibition Constant Data from BindingDB
Found 1 hit for monomerid = 50346288
Trg + Lig
Ki
nM
ΔG°
kcal/mole
IC50
nM
Kd
nM
EC50/IC50
nM
koff
s-1
kon
M-1s-1
pHTemp
°C
3-hydroxy-3-methylglutaryl-coenzyme A reductase
(Rattus norvegicus (rat))
BDBM50346288
(CHEMBL1782560 | sodium(3R,5R)-7-(5-cyclopropyl-4-(...)
Show SMILES O[C@H](CCn1c(nc(C(=O)NCc2ccc(F)c(F)c2)c1C1CC1)-c1ccc(F)cc1)C[C@@H](O)CC([O-])=O |r|
Show InChI InChI=1S/C27H28F3N3O5/c28-18-6-4-17(5-7-18)26-32-24(27(38)31-14-15-1-8-21(29)22(30)11-15)25(16-2-3-16)33(26)10-9-19(34)12-20(35)13-23(36)37/h1,4-8,11,16,19-20,34-35H,2-3,9-10,12-14H2,(H,31,38)(H,36,37)/p-1/t19-,20-/m1/s1
Reactome pathway
n/an/a 1.20n/an/an/an/an/an/a
Pfizer Inc.
Curated by ChEMBL
Assay Description
Inhibition of HMG-CoA reductase in Sprague-Dawley rat liver microsomes using using [14C]HMG-CoA as substrate preincubated for 0.5 hrs before substrat...
Bioorg Med Chem Lett 21: 2725-31 (2011)
Article DOI: 10.1016/j.bmcl.2010.11.103
BindingDB Entry DOI: 10.7270/Q2H995J1