BDBM50346408 2-(((1R,9aR)-octahydro-1H-quinolizin-1-yl)methylthio)-1-(10H-phenothiazin-10-yl)ethanone::CHEMBL1782733
SMILES: O=C(CSC[C@@H]1CCCN2CCCC[C@H]12)N1c2ccccc2Sc2ccccc12
InChI Key: InChIKey=IZNKKWAMYBRXGH-RBUKOAKNSA-N
Data: 1 IC50
Activity Spreadsheet -- Enzyme Inhibition Constant Data from BindingDB
Found 1 hit for monomerid = 50346408
Trg + Lig
Ki
nM
ΔG°
kcal/mole
IC50
nM
Kd
nM
EC50/IC50
nM
koff
s-1
kon
M-1s-1
pHTemp
°C
Butyrylcholinesterase (BuChE)
(Equus caballus (Horse))
BDBM50346408
(2-(((1R,9aR)-octahydro-1H-quinolizin-1-yl)methylth...)
Show SMILES O=C(CSC[C@@H]1CCCN2CCCC[C@H]12)N1c2ccccc2Sc2ccccc12 |r|
Show InChI InChI=1S/C24H28N2OS2/c27-24(17-28-16-18-8-7-15-25-14-6-5-9-19(18)25)26-20-10-1-3-12-22(20)29-23-13-4-2-11-21(23)26/h1-4,10-13,18-19H,5-9,14-17H2/t18-,19+/m0/s1
n/an/a 430n/an/an/an/an/an/a
Universit£ degli Studi di Genova
Curated by ChEMBL
Assay Description
Inhibition of Equine serum BChE using butyrylthiocoline iodide as a substrate after 20 mins by Ellman's assay
Eur J Med Chem 46: 2170-84 (2011)
Article DOI: 10.1016/j.ejmech.2011.02.071
BindingDB Entry DOI: 10.7270/Q2BK1CPG