BDBM50346543 CHEMBL1797750
SMILES: Cc1ccc(cc1)C1CC(=O)Nc2ccc3cc(C)ccc3c12
InChI Key: InChIKey=LWEKMYBEUVCTHN-UHFFFAOYSA-N
Data: 1 IC50
Activity Spreadsheet -- Enzyme Inhibition Constant Data from BindingDB
Found 1 hit for monomerid = 50346543
Trg + Lig
Ki
nM
ΔG°
kcal/mole
IC50
nM
Kd
nM
EC50/IC50
nM
koff
s-1
kon
M-1s-1
pHTemp
°C
NAD-Dependent Deacetylase Sirtuin-1
(Homo sapiens (Human))
BDBM50346543
(CHEMBL1797750)
Show SMILES Cc1ccc(cc1)C1CC(=O)Nc2ccc3cc(C)ccc3c12
Show InChI InChI=1S/C21H19NO/c1-13-3-6-15(7-4-13)18-12-20(23)22-19-10-8-16-11-14(2)5-9-17(16)21(18)19/h3-11,18H,12H2,1-2H3,(H,22,23)
NCI pathway
Reactome pathway
n/an/a 98n/an/an/an/an/an/a
Ernst-Moritz-Arndt-University Greifswald
Curated by ChEMBL
Assay Description
Inhibition of SIRT1
Bioorg Med Chem 19: 3669-77 (2011)
Article DOI: 10.1016/j.bmc.2011.01.026
BindingDB Entry DOI: 10.7270/Q2XD121S