BDBM50346689 CHEMBL1796879
SMILES: CC(=O)NCCNCCNC(=O)[C@]12CCC(C)(C)C[C@H]1C1=CC[C@@H]3[C@@]4(C)CC[C@H](OC(C)=O)C(C)(C)[C@@H]4CC[C@@]3(C)[C@]1(C)CC2
InChI Key: InChIKey=BJXYQHVPAPQXLY-PFEIYBFSSA-N
Data: 1 IC50
Activity Spreadsheet -- Enzyme Inhibition Constant Data from BindingDB
Found 1 hit for monomerid = 50346689
Trg + Lig
Ki
nM
ΔG°
kcal/mole
IC50
nM
Kd
nM
EC50/IC50
nM
koff
s-1
kon
M-1s-1
pHTemp
°C
Glycogen phosphorylase, muscle form
(Oryctolagus cuniculus (rabbit))
BDBM50346689
(CHEMBL1796879)
Show SMILES CC(=O)NCCNCCNC(=O)[C@]12CCC(C)(C)C[C@H]1C1=CC[C@@H]3[C@@]4(C)CC[C@H](OC(C)=O)C(C)(C)[C@@H]4CC[C@@]3(C)[C@]1(C)CC2 |r,t:21|
Show InChI InChI=1S/C38H63N3O4/c1-25(42)40-22-20-39-21-23-41-32(44)38-18-16-33(3,4)24-28(38)27-10-11-30-35(7)14-13-31(45-26(2)43)34(5,6)29(35)12-15-37(30,9)36(27,8)17-19-38/h10,28-31,39H,11-24H2,1-9H3,(H,40,42)(H,41,44)/t28-,29-,30+,31-,35-,36+,37+,38-/m0/s1
n/an/a 3.25E+3n/an/an/an/an/an/a
Chinese Academy of Sciences
Curated by ChEMBL
Assay Description
Inhibition of rabbit muscle glycogen phosphorylase A assessed as release of phosphate from glucose-1-phosphate after 25 mins by microplate reader bas...
Eur J Med Chem 46: 2011-21 (2011)
Article DOI: 10.1016/j.ejmech.2011.02.053
BindingDB Entry DOI: 10.7270/Q2DB826B