BDBM50346819 CHEMBL1796014
SMILES: COc1cc(O)cc(CCc2ccc(cc2)N(C)C)c1
InChI Key: InChIKey=GMINQXXHOHXSJV-UHFFFAOYSA-N
Data: 1 IC50
Activity Spreadsheet -- Enzyme Inhibition Constant Data from BindingDB
Found 1 hit for monomerid = 50346819
Trg + Lig
Ki
nM
ΔG°
kcal/mole
IC50
nM
Kd
nM
EC50/IC50
nM
koff
s-1
kon
M-1s-1
pHTemp
°C
Calmodulin-2
(Homo sapiens (Human))
BDBM50346819
(CHEMBL1796014)
Show SMILES COc1cc(O)cc(CCc2ccc(cc2)N(C)C)c1
Show InChI InChI=1S/C17H21NO2/c1-18(2)15-8-6-13(7-9-15)4-5-14-10-16(19)12-17(11-14)20-3/h6-12,19H,4-5H2,1-3H3
NCI pathway
Reactome pathway
n/an/a 3.01E+4n/an/an/an/an/an/a
Universidad Nacional Aut£noma de M£xico
Curated by ChEMBL
Assay Description
Inhibition of Calmodulin-dependent PDE1 activity assessed as inorganic phosphate release after 30 min
Eur J Med Chem 46: 2699-708 (2011)
Article DOI: 10.1016/j.ejmech.2011.03.057
BindingDB Entry DOI: 10.7270/Q2MW2HGD