BDBM50346820 CHEMBL1796013
SMILES: CCOc1ccc(CCc2cc(OC)cc(OC)c2)cc1OC
InChI Key: InChIKey=WVWGGXWFZVATLO-UHFFFAOYSA-N
Data: 1 IC50
Activity Spreadsheet -- Enzyme Inhibition Constant Data from BindingDB
Found 1 hit for monomerid = 50346820
Trg + Lig
Ki
nM
ΔG°
kcal/mole
IC50
nM
Kd
nM
EC50/IC50
nM
koff
s-1
kon
M-1s-1
pHTemp
°C
Calmodulin-2
(Homo sapiens (Human))
BDBM50346820
(CHEMBL1796013)
Show SMILES CCOc1ccc(CCc2cc(OC)cc(OC)c2)cc1OC
Show InChI InChI=1S/C19H24O4/c1-5-23-18-9-8-14(12-19(18)22-4)6-7-15-10-16(20-2)13-17(11-15)21-3/h8-13H,5-7H2,1-4H3
NCI pathway
Reactome pathway
n/an/a 1.84E+4n/an/an/an/an/an/a
Universidad Nacional Aut£noma de M£xico
Curated by ChEMBL
Assay Description
Inhibition of Calmodulin-dependent PDE1 activity assessed as inorganic phosphate release after 30 min
Eur J Med Chem 46: 2699-708 (2011)
Article DOI: 10.1016/j.ejmech.2011.03.057
BindingDB Entry DOI: 10.7270/Q2MW2HGD