BDBM50346854 CHEMBL1796887
SMILES: OC(=O)CN1C(=O)S\C(=C/C=C/c2ccc(cc2)C(F)(F)F)C1=O
InChI Key: InChIKey=DQLWNOQVOPSJGI-YUTSCENRSA-N
Data: 1 IC50
Activity Spreadsheet -- Enzyme Inhibition Constant Data from BindingDB
Found 1 hit for monomerid = 50346854
Trg + Lig
Ki
nM
ΔG°
kcal/mole
IC50
nM
Kd
nM
EC50/IC50
nM
koff
s-1
kon
M-1s-1
pHTemp
°C
Aldose reductase (ALR2)
(Bos taurus (Cattle))
BDBM50346854
(CHEMBL1796887)
Show SMILES OC(=O)CN1C(=O)S\C(=C/C=C/c2ccc(cc2)C(F)(F)F)C1=O
Show InChI InChI=1S/C15H10F3NO4S/c16-15(17,18)10-6-4-9(5-7-10)2-1-3-11-13(22)19(8-12(20)21)14(23)24-11/h1-7H,8H2,(H,20,21)/b2-1+,11-3-
n/an/a 300n/an/an/an/an/an/a
Universit£ di Messina
Curated by ChEMBL
Assay Description
Inhibition of bovine lens ALR2
Eur J Med Chem 46: 2797-806 (2011)
Article DOI: 10.1016/j.ejmech.2011.03.068
BindingDB Entry DOI: 10.7270/Q2CF9QFF