BDBM50346926 CHEMBL1795688
SMILES: Cc1ccc(cc1-n1cnc(SCc2ccc(F)cc2F)c(Cl)c1=O)C(=O)NCCO
InChI Key: InChIKey=OWSWZPOLVHCEMK-UHFFFAOYSA-N
Data: 1 IC50
Activity Spreadsheet -- Enzyme Inhibition Constant Data from BindingDB
Found 1 hit for monomerid = 50346926
Trg + Lig
Ki
nM
ΔG°
kcal/mole
IC50
nM
Kd
nM
EC50/IC50
nM
koff
s-1
kon
M-1s-1
pHTemp
°C
Mitogen-activated protein kinase 14
(Homo sapiens (Human))
BDBM50346926
(CHEMBL1795688)
Show SMILES Cc1ccc(cc1-n1cnc(SCc2ccc(F)cc2F)c(Cl)c1=O)C(=O)NCCO
Show InChI InChI=1S/C21H18ClF2N3O3S/c1-12-2-3-13(19(29)25-6-7-28)8-17(12)27-11-26-20(18(22)21(27)30)31-10-14-4-5-15(23)9-16(14)24/h2-5,8-9,11,28H,6-7,10H2,1H3,(H,25,29)
NCI pathway
Reactome pathway
n/an/a 193n/an/an/an/an/an/a
Pfizer Inc.
Curated by ChEMBL
Assay Description
Inhibition of p38alpha kinase-dependent HSP-27 phosphorylation in human U937 cells
Bioorg Med Chem Lett 21: 3856-60 (2011)
Article DOI: 10.1016/j.bmcl.2011.05.006
BindingDB Entry DOI: 10.7270/Q2G73F2S