BDBM50347000 CHEMBL1795902
SMILES: COCCCc1cc(CN(C2CC2)C(=O)[C@H]2CNCC[C@@H]2c2cccnc2)cc(OCCOC)c1
InChI Key: InChIKey=MNXUKHSUKAGVLU-SXOMAYOGSA-N
Data: 1 KI  2 IC50
Activity Spreadsheet -- Enzyme Inhibition Constant Data from BindingDB
Found 3 hits for monomerid = 50347000
Trg + Lig
Ki
nM
ΔG°
kcal/mole
IC50
nM
Kd
nM
EC50/IC50
nM
koff
s-1
kon
M-1s-1
pHTemp
°C
Potassium voltage-gated channel subfamily H member 2
(Homo sapiens (Human))
BDBM50347000
(CHEMBL1795902)
Show SMILES COCCCc1cc(CN(C2CC2)C(=O)[C@H]2CNCC[C@@H]2c2cccnc2)cc(OCCOC)c1 |r|
Show InChI InChI=1S/C28H39N3O4/c1-33-12-4-5-21-15-22(17-25(16-21)35-14-13-34-2)20-31(24-7-8-24)28(32)27-19-30-11-9-26(27)23-6-3-10-29-18-23/h3,6,10,15-18,24,26-27,30H,4-5,7-9,11-14,19-20H2,1-2H3/t26-,27+/m1/s1
Reactome pathway
>2.90E+4n/an/an/an/an/an/an/an/a
Merck Frosst Centre for Therapeutic Research
Curated by ChEMBL
Assay Description
Inhibition of human ERG
Bioorg Med Chem Lett 21: 3970-5 (2011)
Article DOI: 10.1016/j.bmcl.2011.05.013
BindingDB Entry DOI: 10.7270/Q2PN9608
Renin
(Homo sapiens (Human))
BDBM50347000
(CHEMBL1795902)
Show SMILES COCCCc1cc(CN(C2CC2)C(=O)[C@H]2CNCC[C@@H]2c2cccnc2)cc(OCCOC)c1 |r|
Show InChI InChI=1S/C28H39N3O4/c1-33-12-4-5-21-15-22(17-25(16-21)35-14-13-34-2)20-31(24-7-8-24)28(32)27-19-30-11-9-26(27)23-6-3-10-29-18-23/h3,6,10,15-18,24,26-27,30H,4-5,7-9,11-14,19-20H2,1-2H3/t26-,27+/m1/s1
Reactome pathway
n/an/a 45n/an/an/an/an/an/a
Merck Frosst Centre for Therapeutic Research
Curated by ChEMBL
Assay Description
Inhibition of human recombinant renin using Q-FRET substrate after 3 hrs by fluorescence assay
Bioorg Med Chem Lett 21: 3970-5 (2011)
Article DOI: 10.1016/j.bmcl.2011.05.013
BindingDB Entry DOI: 10.7270/Q2PN9608
Renin
(Homo sapiens (Human))
BDBM50347000
(CHEMBL1795902)
Show SMILES COCCCc1cc(CN(C2CC2)C(=O)[C@H]2CNCC[C@@H]2c2cccnc2)cc(OCCOC)c1 |r|
Show InChI InChI=1S/C28H39N3O4/c1-33-12-4-5-21-15-22(17-25(16-21)35-14-13-34-2)20-31(24-7-8-24)28(32)27-19-30-11-9-26(27)23-6-3-10-29-18-23/h3,6,10,15-18,24,26-27,30H,4-5,7-9,11-14,19-20H2,1-2H3/t26-,27+/m1/s1
Reactome pathway
n/an/a 140n/an/an/an/an/an/a
Merck Frosst Centre for Therapeutic Research
Curated by ChEMBL
Assay Description
Inhibition of renin in human plasma using Q-FRET substrate pretreated for 10 mins before substrate addition measured after 1 hr
Bioorg Med Chem Lett 21: 3970-5 (2011)
Article DOI: 10.1016/j.bmcl.2011.05.013
BindingDB Entry DOI: 10.7270/Q2PN9608