BDBM50347010 CHEMBL1796063
SMILES: COCCCc1cc(CN(C2CC2)C(=O)[C@H]2CNCC[C@@H]2c2ccn(C)c(=O)c2)cc(Br)c1C
InChI Key: InChIKey=HELJPBHTIIYJPZ-RPWUZVMVSA-N
Data: 1 KI  6 IC50
Activity Spreadsheet -- Enzyme Inhibition Constant Data from BindingDB
Found 7 hits for monomerid = 50347010
Trg + Lig
Ki
nM
ΔG°
kcal/mole
IC50
nM
Kd
nM
EC50/IC50
nM
koff
s-1
kon
M-1s-1
pHTemp
°C
Potassium voltage-gated channel subfamily H member 2
(Homo sapiens (Human))
BDBM50347010
(CHEMBL1796063)
Show SMILES COCCCc1cc(CN(C2CC2)C(=O)[C@H]2CNCC[C@@H]2c2ccn(C)c(=O)c2)cc(Br)c1C |r|
Show InChI InChI=1S/C27H36BrN3O3/c1-18-20(5-4-12-34-3)13-19(14-25(18)28)17-31(22-6-7-22)27(33)24-16-29-10-8-23(24)21-9-11-30(2)26(32)15-21/h9,11,13-15,22-24,29H,4-8,10,12,16-17H2,1-3H3/t23-,24+/m1/s1
Reactome pathway
1.80E+4n/an/an/an/an/an/an/an/a
Merck Frosst Centre for Therapeutic Research
Curated by ChEMBL
Assay Description
Inhibition of human ERG
Bioorg Med Chem Lett 21: 3970-5 (2011)
Article DOI: 10.1016/j.bmcl.2011.05.013
BindingDB Entry DOI: 10.7270/Q2PN9608
Cytochrome P450 3A4
(Homo sapiens (Human))
BDBM50347010
(CHEMBL1796063)
Show SMILES COCCCc1cc(CN(C2CC2)C(=O)[C@H]2CNCC[C@@H]2c2ccn(C)c(=O)c2)cc(Br)c1C |r|
Show InChI InChI=1S/C27H36BrN3O3/c1-18-20(5-4-12-34-3)13-19(14-25(18)28)17-31(22-6-7-22)27(33)24-16-29-10-8-23(24)21-9-11-30(2)26(32)15-21/h9,11,13-15,22-24,29H,4-8,10,12,16-17H2,1-3H3/t23-,24+/m1/s1
Reactome pathway
n/an/a 2.00E+4n/an/an/an/an/an/a
Merck Frosst Centre for Therapeutic Research
Curated by ChEMBL
Assay Description
Time dependent inhibition of CYP3A4 assessed as conversion of testosterone to 6-beta-hydroxytestosterone
Bioorg Med Chem Lett 21: 3970-5 (2011)
Article DOI: 10.1016/j.bmcl.2011.05.013
BindingDB Entry DOI: 10.7270/Q2PN9608
Cytochrome P450 3A4
(Homo sapiens (Human))
BDBM50347010
(CHEMBL1796063)
Show SMILES COCCCc1cc(CN(C2CC2)C(=O)[C@H]2CNCC[C@@H]2c2ccn(C)c(=O)c2)cc(Br)c1C |r|
Show InChI InChI=1S/C27H36BrN3O3/c1-18-20(5-4-12-34-3)13-19(14-25(18)28)17-31(22-6-7-22)27(33)24-16-29-10-8-23(24)21-9-11-30(2)26(32)15-21/h9,11,13-15,22-24,29H,4-8,10,12,16-17H2,1-3H3/t23-,24+/m1/s1
Reactome pathway
n/an/a 1.60E+4n/an/an/an/an/an/a
Merck Frosst Centre for Therapeutic Research
Curated by ChEMBL
Assay Description
Time dependent inhibition of CYP3A4 assessed as conversion of testosterone to 6-beta-hydroxytestosterone preincubated for 30 mins
Bioorg Med Chem Lett 21: 3970-5 (2011)
Article DOI: 10.1016/j.bmcl.2011.05.013
BindingDB Entry DOI: 10.7270/Q2PN9608
Cytochrome P450 3A4
(Homo sapiens (Human))
BDBM50347010
(CHEMBL1796063)
Show SMILES COCCCc1cc(CN(C2CC2)C(=O)[C@H]2CNCC[C@@H]2c2ccn(C)c(=O)c2)cc(Br)c1C |r|
Show InChI InChI=1S/C27H36BrN3O3/c1-18-20(5-4-12-34-3)13-19(14-25(18)28)17-31(22-6-7-22)27(33)24-16-29-10-8-23(24)21-9-11-30(2)26(32)15-21/h9,11,13-15,22-24,29H,4-8,10,12,16-17H2,1-3H3/t23-,24+/m1/s1
Reactome pathway
n/an/a 6.50E+3n/an/an/an/an/an/a
Merck Frosst Centre for Therapeutic Research
Curated by ChEMBL
Assay Description
Reversible inhibition of CYP3A4 assessed as conversion of testosterone to 6-beta-hydroxytestosterone
Bioorg Med Chem Lett 21: 3970-5 (2011)
Article DOI: 10.1016/j.bmcl.2011.05.013
BindingDB Entry DOI: 10.7270/Q2PN9608
Renin
(Homo sapiens (Human))
BDBM50347010
(CHEMBL1796063)
Show SMILES COCCCc1cc(CN(C2CC2)C(=O)[C@H]2CNCC[C@@H]2c2ccn(C)c(=O)c2)cc(Br)c1C |r|
Show InChI InChI=1S/C27H36BrN3O3/c1-18-20(5-4-12-34-3)13-19(14-25(18)28)17-31(22-6-7-22)27(33)24-16-29-10-8-23(24)21-9-11-30(2)26(32)15-21/h9,11,13-15,22-24,29H,4-8,10,12,16-17H2,1-3H3/t23-,24+/m1/s1
Reactome pathway
n/an/a 2.40n/an/an/an/an/an/a
Merck Frosst Centre for Therapeutic Research
Curated by ChEMBL
Assay Description
Inhibition of renin in human plasma using Q-FRET substrate pretreated for 10 mins before substrate addition measured after 1 hr
Bioorg Med Chem Lett 21: 3970-5 (2011)
Article DOI: 10.1016/j.bmcl.2011.05.013
BindingDB Entry DOI: 10.7270/Q2PN9608
Renin
(Homo sapiens (Human))
BDBM50347010
(CHEMBL1796063)
Show SMILES COCCCc1cc(CN(C2CC2)C(=O)[C@H]2CNCC[C@@H]2c2ccn(C)c(=O)c2)cc(Br)c1C |r|
Show InChI InChI=1S/C27H36BrN3O3/c1-18-20(5-4-12-34-3)13-19(14-25(18)28)17-31(22-6-7-22)27(33)24-16-29-10-8-23(24)21-9-11-30(2)26(32)15-21/h9,11,13-15,22-24,29H,4-8,10,12,16-17H2,1-3H3/t23-,24+/m1/s1
Reactome pathway
n/an/a 1n/an/an/an/an/an/a
Merck Frosst Centre for Therapeutic Research
Curated by ChEMBL
Assay Description
Inhibition of human recombinant renin using Q-FRET substrate after 3 hrs by fluorescence assay
Bioorg Med Chem Lett 21: 3970-5 (2011)
Article DOI: 10.1016/j.bmcl.2011.05.013
BindingDB Entry DOI: 10.7270/Q2PN9608
Renin
(Homo sapiens (Human))
BDBM50347010
(CHEMBL1796063)
Show SMILES COCCCc1cc(CN(C2CC2)C(=O)[C@H]2CNCC[C@@H]2c2ccn(C)c(=O)c2)cc(Br)c1C |r|
Show InChI InChI=1S/C27H36BrN3O3/c1-18-20(5-4-12-34-3)13-19(14-25(18)28)17-31(22-6-7-22)27(33)24-16-29-10-8-23(24)21-9-11-30(2)26(32)15-21/h9,11,13-15,22-24,29H,4-8,10,12,16-17H2,1-3H3/t23-,24+/m1/s1
Reactome pathway
n/an/a 1n/an/an/an/an/an/a
Merck Research Laboratories
Curated by ChEMBL
Assay Description
Inhibition of renin (unknown origin)
Bioorg Med Chem Lett 25: 1592-6 (2015)
Article DOI: 10.1016/j.bmcl.2015.02.003
BindingDB Entry DOI: 10.7270/Q2X63PMJ