BDBM50347100 CHEMBL1797203
SMILES: Cc1cccc(C)c1-n1c(C)cc(OCc2ccc(F)cc2F)c(Br)c1=O
InChI Key: InChIKey=LZQSJJLHDYOERR-UHFFFAOYSA-N
Data: 1 IC50
Activity Spreadsheet -- Enzyme Inhibition Constant Data from BindingDB
Found 1 hit for monomerid = 50347100
Trg + Lig
Ki
nM
ΔG°
kcal/mole
IC50
nM
Kd
nM
EC50/IC50
nM
koff
s-1
kon
M-1s-1
pHTemp
°C
Mitogen-activated protein kinase 14
(Homo sapiens (Human))
BDBM50347100
(CHEMBL1797203)
Show SMILES Cc1cccc(C)c1-n1c(C)cc(OCc2ccc(F)cc2F)c(Br)c1=O |(29.24,-20.12,;29.24,-21.66,;30.57,-22.42,;30.57,-23.97,;29.24,-24.74,;27.91,-23.97,;26.57,-24.73,;27.92,-22.43,;26.58,-21.65,;26.58,-20.11,;27.92,-19.35,;25.25,-19.34,;23.92,-20.11,;22.59,-19.35,;21.26,-20.12,;19.92,-19.36,;18.6,-20.13,;17.27,-19.37,;17.26,-17.82,;15.92,-17.06,;18.59,-17.05,;19.92,-17.82,;21.26,-17.05,;23.92,-21.65,;22.59,-22.43,;25.25,-22.42,;25.25,-23.96,)|
Show InChI InChI=1S/C21H18BrF2NO2/c1-12-5-4-6-13(2)20(12)25-14(3)9-18(19(22)21(25)26)27-11-15-7-8-16(23)10-17(15)24/h4-10H,11H2,1-3H3
NCI pathway
Reactome pathway
n/an/a 2n/an/an/an/an/an/a
Pfizer Inc.
Curated by ChEMBL
Assay Description
Inhibition of p38alpha assessed as phosphorylation of fluorescently-labelled MK2 using Hsp27 peptide as substrate after 60 mins by fluorescence assay
Bioorg Med Chem Lett 21: 4059-65 (2011)
Article DOI: 10.1016/j.bmcl.2011.04.120
BindingDB Entry DOI: 10.7270/Q25Q4WFH