BDBM50347182 CHEMBL1795565
SMILES: CON=C(C(=O)NCP(O)(=O)Oc1ccc(C#N)c(F)c1)c1cccs1
InChI Key: InChIKey=PMZACNGXOXJZRR-UHFFFAOYSA-N
Data: 4 IC50
Activity Spreadsheet -- Enzyme Inhibition Constant Data from BindingDB
Found 4 hits for monomerid = 50347182
Trg + Lig
Ki
nM
ΔG°
kcal/mole
IC50
nM
Kd
nM
EC50/IC50
nM
koff
s-1
kon
M-1s-1
pHTemp
°C
Beta-lactamase SHV-5
(Klebsiella pneumoniae)
BDBM50347182
(CHEMBL1795565)
Show SMILES CON=C(C(=O)NCP(O)(=O)Oc1ccc(C#N)c(F)c1)c1cccs1 |w:2.1|
Show InChI InChI=1S/C15H13FN3O5PS/c1-23-19-14(13-3-2-6-26-13)15(20)18-9-25(21,22)24-11-5-4-10(8-17)12(16)7-11/h2-7H,9H2,1H3,(H,18,20)(H,21,22)
n/an/a>5.00E+4n/an/an/an/an/an/a
Merck& Co.
Curated by ChEMBL
Assay Description
Inhibition of Klebsiella pneumoniae beta lactamase SHV-5
Bioorg Med Chem Lett 21: 4363-5 (2011)
Article DOI: 10.1016/j.bmcl.2011.04.122
BindingDB Entry DOI: 10.7270/Q24Q7V94
Beta-lactamase
(Acinetobacter baumannii)
BDBM50347182
(CHEMBL1795565)
Show SMILES CON=C(C(=O)NCP(O)(=O)Oc1ccc(C#N)c(F)c1)c1cccs1 |w:2.1|
Show InChI InChI=1S/C15H13FN3O5PS/c1-23-19-14(13-3-2-6-26-13)15(20)18-9-25(21,22)24-11-5-4-10(8-17)12(16)7-11/h2-7H,9H2,1H3,(H,18,20)(H,21,22)
n/an/a>5.00E+4n/an/an/an/an/an/a
Merck& Co.
Curated by ChEMBL
Assay Description
Inhibition of Acinetobacter baumannii beta lactamase OXA-40
Bioorg Med Chem Lett 21: 4363-5 (2011)
Article DOI: 10.1016/j.bmcl.2011.04.122
BindingDB Entry DOI: 10.7270/Q24Q7V94
Beta-lactamase
(Enterobacter cloacae)
BDBM50347182
(CHEMBL1795565)
Show SMILES CON=C(C(=O)NCP(O)(=O)Oc1ccc(C#N)c(F)c1)c1cccs1 |w:2.1|
Show InChI InChI=1S/C15H13FN3O5PS/c1-23-19-14(13-3-2-6-26-13)15(20)18-9-25(21,22)24-11-5-4-10(8-17)12(16)7-11/h2-7H,9H2,1H3,(H,18,20)(H,21,22)
n/an/a 39n/an/an/an/an/an/a
Merck& Co.
Curated by ChEMBL
Assay Description
Inhibition of Enterobacter cloacae beta lactamase P99
Bioorg Med Chem Lett 21: 4363-5 (2011)
Article DOI: 10.1016/j.bmcl.2011.04.122
BindingDB Entry DOI: 10.7270/Q24Q7V94
Beta-lactamase
(Pseudomonas aeruginosa (PAO1))
BDBM50347182
(CHEMBL1795565)
Show SMILES CON=C(C(=O)NCP(O)(=O)Oc1ccc(C#N)c(F)c1)c1cccs1 |w:2.1|
Show InChI InChI=1S/C15H13FN3O5PS/c1-23-19-14(13-3-2-6-26-13)15(20)18-9-25(21,22)24-11-5-4-10(8-17)12(16)7-11/h2-7H,9H2,1H3,(H,18,20)(H,21,22)
n/an/a 9.60n/an/an/an/an/an/a
Merck& Co.
Curated by ChEMBL
Assay Description
Inhibition of Pseudomonas aeruginosa beta lactamase AmpC
Bioorg Med Chem Lett 21: 4363-5 (2011)
Article DOI: 10.1016/j.bmcl.2011.04.122
BindingDB Entry DOI: 10.7270/Q24Q7V94