BDBM50347189 CHEMBL1795572
SMILES: CO\N=C(\C(=O)NCP(O)(=O)Oc1ccc(C#N)c(F)c1)c1ccc(Cl)s1
InChI Key: InChIKey=YTERKPPCUDHTHK-XSFVSMFZSA-N
Data: 3 IC50
Activity Spreadsheet -- Enzyme Inhibition Constant Data from BindingDB
Found 3 hits for monomerid = 50347189
Trg + Lig
Ki
nM
ΔG°
kcal/mole
IC50
nM
Kd
nM
EC50/IC50
nM
koff
s-1
kon
M-1s-1
pHTemp
°C
Beta-lactamase
(Pseudomonas aeruginosa (PAO1))
BDBM50347189
(CHEMBL1795572)
Show SMILES CO\N=C(\C(=O)NCP(O)(=O)Oc1ccc(C#N)c(F)c1)c1ccc(Cl)s1
Show InChI InChI=1S/C15H12ClFN3O5PS/c1-24-20-14(12-4-5-13(16)27-12)15(21)19-8-26(22,23)25-10-3-2-9(7-18)11(17)6-10/h2-6H,8H2,1H3,(H,19,21)(H,22,23)/b20-14+
n/an/a 5n/an/an/an/an/an/a
Merck& Co.
Curated by ChEMBL
Assay Description
Inhibition of Pseudomonas aeruginosa beta lactamase AmpC
Bioorg Med Chem Lett 21: 4363-5 (2011)
Article DOI: 10.1016/j.bmcl.2011.04.122
BindingDB Entry DOI: 10.7270/Q24Q7V94
Beta-lactamase
(Acinetobacter baumannii)
BDBM50347189
(CHEMBL1795572)
Show SMILES CO\N=C(\C(=O)NCP(O)(=O)Oc1ccc(C#N)c(F)c1)c1ccc(Cl)s1
Show InChI InChI=1S/C15H12ClFN3O5PS/c1-24-20-14(12-4-5-13(16)27-12)15(21)19-8-26(22,23)25-10-3-2-9(7-18)11(17)6-10/h2-6H,8H2,1H3,(H,19,21)(H,22,23)/b20-14+
n/an/a 3.10E+4n/an/an/an/an/an/a
Merck& Co.
Curated by ChEMBL
Assay Description
Inhibition of Acinetobacter baumannii beta lactamase OXA-40
Bioorg Med Chem Lett 21: 4363-5 (2011)
Article DOI: 10.1016/j.bmcl.2011.04.122
BindingDB Entry DOI: 10.7270/Q24Q7V94
Beta-lactamase
(Enterobacter cloacae)
BDBM50347189
(CHEMBL1795572)
Show SMILES CO\N=C(\C(=O)NCP(O)(=O)Oc1ccc(C#N)c(F)c1)c1ccc(Cl)s1
Show InChI InChI=1S/C15H12ClFN3O5PS/c1-24-20-14(12-4-5-13(16)27-12)15(21)19-8-26(22,23)25-10-3-2-9(7-18)11(17)6-10/h2-6H,8H2,1H3,(H,19,21)(H,22,23)/b20-14+
n/an/a 19n/an/an/an/an/an/a
Merck& Co.
Curated by ChEMBL
Assay Description
Inhibition of Enterobacter cloacae beta lactamase P99
Bioorg Med Chem Lett 21: 4363-5 (2011)
Article DOI: 10.1016/j.bmcl.2011.04.122
BindingDB Entry DOI: 10.7270/Q24Q7V94