BDBM50347190 CHEMBL1795742
SMILES: O=c1nc(oc2ccc3ccccc3c12)N1CCOCC1
InChI Key: InChIKey=OGOAHUWJEYJQRQ-UHFFFAOYSA-N
Data: 1 IC50
Activity Spreadsheet -- Enzyme Inhibition Constant Data from BindingDB
Found 1 hit for monomerid = 50347190
Trg + Lig
Ki
nM
ΔG°
kcal/mole
IC50
nM
Kd
nM
EC50/IC50
nM
koff
s-1
kon
M-1s-1
pHTemp
°C
DNA-dependent protein kinase catalytic subunit
(Homo sapiens (Human))
BDBM50347190
(CHEMBL1795742)
Show SMILES O=c1nc(oc2ccc3ccccc3c12)N1CCOCC1
Show InChI InChI=1S/C16H14N2O3/c19-15-14-12-4-2-1-3-11(12)5-6-13(14)21-16(17-15)18-7-9-20-10-8-18/h1-6H,7-10H2
n/an/a 720n/an/an/an/an/an/a
La Trobe University
Curated by ChEMBL
Assay Description
Inhibition of purified DNA-PK by ADP-Glo Kinase assay
Bioorg Med Chem 19: 3983-94 (2011)
Article DOI: 10.1016/j.bmc.2011.05.032
BindingDB Entry DOI: 10.7270/Q20Z73M7