BDBM50347283 CHEMBL1796131
SMILES: CCN(CC)CCCNC(=O)c1ccc2c(c1)N(Cc1ccc(C)cc1C)C(=O)c1ccccc1S2=O
InChI Key: InChIKey=FZXIWDFNEZVGIF-UHFFFAOYSA-N
Data: 1 IC50
Activity Spreadsheet -- Enzyme Inhibition Constant Data from BindingDB
Found 1 hit for monomerid = 50347283
Trg + Lig
Ki
nM
ΔG°
kcal/mole
IC50
nM
Kd
nM
EC50/IC50
nM
koff
s-1
kon
M-1s-1
pHTemp
°C
L-cysteine:1D-myo-inositol 2-amino-2-deoxy-alpha-D-glucopyranoside ligase
(Mycobacterium tuberculosis)
BDBM50347283
(CHEMBL1796131)
Show SMILES CCN(CC)CCCNC(=O)c1ccc2c(c1)N(Cc1ccc(C)cc1C)C(=O)c1ccccc1S2=O
Show InChI InChI=1S/C30H35N3O3S/c1-5-32(6-2)17-9-16-31-29(34)23-14-15-28-26(19-23)33(20-24-13-12-21(3)18-22(24)4)30(35)25-10-7-8-11-27(25)37(28)36/h7-8,10-15,18-19H,5-6,9,16-17,20H2,1-4H3,(H,31,34)
Reactome pathway
n/an/a>3.00E+6n/an/an/an/an/an/a
University of California
Curated by ChEMBL
Assay Description
Inhibition of Mycobacterium tuberculosis recombinant MshC assessed as production of Cys-GlcN-Ins from cysteine by HPLC based fluorescence assay
Bioorg Med Chem 19: 3956-64 (2011)
Article DOI: 10.1016/j.bmc.2011.05.028
BindingDB Entry DOI: 10.7270/Q2MS3T40