BDBM50347313 CHEMBL1796835
SMILES: CCCCCc1ccc(cc1)S(=O)(=O)NCCc1c(n[nH]c1-c1ccccc1)-c1ccccc1OC
InChI Key: InChIKey=FZYCNLKMRNRESI-UHFFFAOYSA-N
Data: 1 IC50
Activity Spreadsheet -- Enzyme Inhibition Constant Data from BindingDB
Found 1 hit for monomerid = 50347313
Trg + Lig
Ki
nM
ΔG°
kcal/mole
IC50
nM
Kd
nM
EC50/IC50
nM
koff
s-1
kon
M-1s-1
pHTemp
°C
Arachidonate 15-lipoxygenase
(Oryctolagus cuniculus (rabbit))
BDBM50347313
(CHEMBL1796835)
Show SMILES CCCCCc1ccc(cc1)S(=O)(=O)NCCc1c(n[nH]c1-c1ccccc1)-c1ccccc1OC
Show InChI InChI=1S/C29H33N3O3S/c1-3-4-6-11-22-16-18-24(19-17-22)36(33,34)30-21-20-26-28(23-12-7-5-8-13-23)31-32-29(26)25-14-9-10-15-27(25)35-2/h5,7-10,12-19,30H,3-4,6,11,20-21H2,1-2H3,(H,31,32)
n/an/a 1.22E+3n/an/an/an/an/an/a
Bristol-Myers Squibb Research and Development
Curated by ChEMBL
Assay Description
Inhibition of rabbit 15-LO using linoleic acid by standard colorimetric assay
Bioorg Med Chem Lett 21: 4141-5 (2011)
Article DOI: 10.1016/j.bmcl.2011.05.107
BindingDB Entry DOI: 10.7270/Q2028RW3