BDBM50347320 CHEMBL1796842
SMILES: CCCCCc1ccc(cc1)S(=O)(=O)NCCc1c(n[nH]c1-c1cccs1)-c1cc(C)on1
InChI Key: InChIKey=AQDYSKXJMBBOMM-UHFFFAOYSA-N
Data: 2 IC50
Activity Spreadsheet -- Enzyme Inhibition Constant Data from BindingDB
Found 2 hits for monomerid = 50347320
Trg + Lig
Ki
nM
ΔG°
kcal/mole
IC50
nM
Kd
nM
EC50/IC50
nM
koff
s-1
kon
M-1s-1
pHTemp
°C
Arachidonate 15-lipoxygenase
(Oryctolagus cuniculus (rabbit))
BDBM50347320
(CHEMBL1796842)
Show SMILES CCCCCc1ccc(cc1)S(=O)(=O)NCCc1c(n[nH]c1-c1cccs1)-c1cc(C)on1
Show InChI InChI=1S/C24H28N4O3S2/c1-3-4-5-7-18-9-11-19(12-10-18)33(29,30)25-14-13-20-23(21-16-17(2)31-28-21)26-27-24(20)22-8-6-15-32-22/h6,8-12,15-16,25H,3-5,7,13-14H2,1-2H3,(H,26,27)
n/an/a 36n/an/an/an/an/an/a
Bristol-Myers Squibb Research and Development
Curated by ChEMBL
Assay Description
Inhibition of rabbit 15-LO using arachidonic acid by standard colorimetric assay
Bioorg Med Chem Lett 21: 4141-5 (2011)
Article DOI: 10.1016/j.bmcl.2011.05.107
BindingDB Entry DOI: 10.7270/Q2028RW3
Arachidonate 15-lipoxygenase
(Oryctolagus cuniculus (rabbit))
BDBM50347320
(CHEMBL1796842)
Show SMILES CCCCCc1ccc(cc1)S(=O)(=O)NCCc1c(n[nH]c1-c1cccs1)-c1cc(C)on1
Show InChI InChI=1S/C24H28N4O3S2/c1-3-4-5-7-18-9-11-19(12-10-18)33(29,30)25-14-13-20-23(21-16-17(2)31-28-21)26-27-24(20)22-8-6-15-32-22/h6,8-12,15-16,25H,3-5,7,13-14H2,1-2H3,(H,26,27)
n/an/a 10n/an/an/an/an/an/a
Bristol-Myers Squibb Research and Development
Curated by ChEMBL
Assay Description
Inhibition of rabbit 15-LO using linoleic acid by standard colorimetric assay
Bioorg Med Chem Lett 21: 4141-5 (2011)
Article DOI: 10.1016/j.bmcl.2011.05.107
BindingDB Entry DOI: 10.7270/Q2028RW3