BDBM50347477 CHEMBL1802265
SMILES: COc1ccc(OC)c2nc3ccccc3nc12
InChI Key: InChIKey=XSNGJHHLSHMCND-UHFFFAOYSA-N
Data: 1 IC50
Activity Spreadsheet -- Enzyme Inhibition Constant Data from BindingDB
Found 1 hit for monomerid = 50347477
Trg + Lig
Ki
nM
ΔG°
kcal/mole
IC50
nM
Kd
nM
EC50/IC50
nM
koff
s-1
kon
M-1s-1
pHTemp
°C
Ribosyldihydronicotinamide dehydrogenase [quinone]
(Homo sapiens (Human))
BDBM50347477
(CHEMBL1802265)
Show SMILES COc1ccc(OC)c2nc3ccccc3nc12
Show InChI InChI=1S/C14H12N2O2/c1-17-11-7-8-12(18-2)14-13(11)15-9-5-3-4-6-10(9)16-14/h3-8H,1-2H3
n/an/a 3.55E+4n/an/an/an/an/an/a
Purdue University
Curated by ChEMBL
Assay Description
Inhibition of human QR2 expressed in Escherichia coli BL21 (DE3) using MTT and NMeH as substrate assessed as formazan formation
J Med Chem 53: 8688-99 (2010)
Article DOI: 10.1021/jm1011066
BindingDB Entry DOI: 10.7270/Q2TB178C