BDBM50347543 CHEMBL1801948
SMILES: C[C@H]1CCCC(=O)C(=O)C(=O)CCCc2cc(O)cc(O)c2C(=O)O1
InChI Key: InChIKey=UALUYEZXHRSNQH-JTQLQIEISA-N
Data: 2 IC50
Activity Spreadsheet -- Enzyme Inhibition Constant Data from BindingDB
Found 2 hits for monomerid = 50347543
Trg + Lig
Ki
nM
ΔG°
kcal/mole
IC50
nM
Kd
nM
EC50/IC50
nM
koff
s-1
kon
M-1s-1
pHTemp
°C
Acetylcholinesterase
(Electrophorus electricus (Electric eel))
BDBM50347543
(CHEMBL1801948)
Show SMILES C[C@H]1CCCC(=O)C(=O)C(=O)CCCc2cc(O)cc(O)c2C(=O)O1
Show InChI InChI=1S/C18H20O7/c1-10-4-2-6-13(20)17(23)14(21)7-3-5-11-8-12(19)9-15(22)16(11)18(24)25-10/h8-10,19,22H,2-7H2,1H3/t10-/m0/s1
n/an/a 5.20E+3n/an/an/an/an/an/a
Sun Yat-sen University
Curated by ChEMBL
Assay Description
Inhibition of electric eel AChE using acetylthiocholine chloride as substrate after 15 mins by Ellman's method
J Nat Prod 74: 997-1002 (2011)
Article DOI: 10.1021/np100889v
BindingDB Entry DOI: 10.7270/Q21V5FXX
Nuclear factor NF-kappa-B
(Homo sapiens (Human))
BDBM50347543
(CHEMBL1801948)
Show SMILES C[C@H]1CCCC(=O)C(=O)C(=O)CCCc2cc(O)cc(O)c2C(=O)O1
Show InChI InChI=1S/C18H20O7/c1-10-4-2-6-13(20)17(23)14(21)7-3-5-11-8-12(19)9-15(22)16(11)18(24)25-10/h8-10,19,22H,2-7H2,1H3/t10-/m0/s1
n/an/a 750n/an/an/an/an/an/a
University of North Carolina at Greensboro
Curated by ChEMBL
Assay Description
Inhibition of NFkappa p65 isolated from nuclear extract of human HeLa cells by ELISA
J Nat Prod 74: 1126-31 (2011)
Article DOI: 10.1021/np200062x
BindingDB Entry DOI: 10.7270/Q25M6621