BDBM50347684 CHEMBL1803006
SMILES: CS(=O)(=O)Nc1ccc2C=Cc3ncc(cc3C(O)c2c1)-c1ccccc1
InChI Key: InChIKey=WXKUPXNRORPGDD-UHFFFAOYSA-N
Data: 1 IC50
Activity Spreadsheet -- Enzyme Inhibition Constant Data from BindingDB
Found 1 hit for monomerid = 50347684
Trg + Lig
Ki
nM
ΔG°
kcal/mole
IC50
nM
Kd
nM
EC50/IC50
nM
koff
s-1
kon
M-1s-1
pHTemp
°C
Hepatocyte growth factor receptor
(Homo sapiens (Human))
BDBM50347684
(CHEMBL1803006)
Show SMILES CS(=O)(=O)Nc1ccc2C=Cc3ncc(cc3C(O)c2c1)-c1ccccc1 |c:9|
Show InChI InChI=1S/C21H18N2O3S/c1-27(25,26)23-17-9-7-15-8-10-20-19(21(24)18(15)12-17)11-16(13-22-20)14-5-3-2-4-6-14/h2-13,21,23-24H,1H3
n/an/a>1.00E+4n/an/an/an/an/an/a
Merck Research Laboratories
Curated by ChEMBL
Assay Description
Inhibition of human recombinant c-Met-catalyzed phosphorylation of N-biotinylated peptide (EQEDEPEGDYFEWLE-CONH2) by time-resolved fluorescence reson...
J Med Chem 54: 4092-108 (2011)
Article DOI: 10.1021/jm200112k
BindingDB Entry DOI: 10.7270/Q2X34ZFZ