BDBM50347737 CHEMBL1802524
SMILES: OC(=O)c1cccc(Nc2nc(Nc3ccccc3)nc(Nc3ccccc3)n2)c1
InChI Key: InChIKey=QLINFGQSAXACLV-UHFFFAOYSA-N
Data: 1 Kd
Activity Spreadsheet -- Enzyme Inhibition Constant Data from BindingDB
Found 1 hit for monomerid = 50347737
Trg + Lig
Ki
nM
ΔG°
kcal/mole
IC50
nM
Kd
nM
EC50/IC50
nM
koff
s-1
kon
M-1s-1
pHTemp
°C
Transforming protein RhoA
(Homo sapiens (Human))
BDBM50347737
(CHEMBL1802524)
Show SMILES OC(=O)c1cccc(Nc2nc(Nc3ccccc3)nc(Nc3ccccc3)n2)c1
Show InChI InChI=1S/C22H18N6O2/c29-19(30)15-8-7-13-18(14-15)25-22-27-20(23-16-9-3-1-4-10-16)26-21(28-22)24-17-11-5-2-6-12-17/h1-14H,(H,29,30)(H3,23,24,25,26,27,28)
Reactome pathway
n/an/an/a 4.47E+3n/an/an/an/an/a
East China University of Science and Technology
Curated by ChEMBL
Assay Description
Binding affinity to rhoA by SPR assay
J Med Chem 54: 4508-22 (2011)
Article DOI: 10.1021/jm200161c
BindingDB Entry DOI: 10.7270/Q2C53M61