BDBM50347769 CHEMBL1802852
SMILES: COCCNC1=NC(=Cc2ccc3OCOc3c2)C(=O)N1C
InChI Key: InChIKey=AWHBOWPNZZVSPD-UHFFFAOYSA-N
Data: 6 IC50
Activity Spreadsheet -- Enzyme Inhibition Constant Data from BindingDB
Found 6 hits for monomerid = 50347769
Trg + Lig
Ki
nM
ΔG°
kcal/mole
IC50
nM
Kd
nM
EC50/IC50
nM
koff
s-1
kon
M-1s-1
pHTemp
°C
Dual specificity protein kinase CLK1
(Mus musculus)
BDBM50347769
(CHEMBL1802852)
Show SMILES COCCNC1=NC(=Cc2ccc3OCOc3c2)C(=O)N1C |w:8.8,t:5|
Show InChI InChI=1S/C15H17N3O4/c1-18-14(19)11(17-15(18)16-5-6-20-2)7-10-3-4-12-13(8-10)22-9-21-12/h3-4,7-8H,5-6,9H2,1-2H3,(H,16,17)
n/an/a 73n/an/an/an/an/an/a
Universite£? de Rennes 1
Curated by ChEMBL
Assay Description
Inhibition of mouse recombinant GST-tagged CLK1 using GRSRSRSRSRSR as substrate
J Med Chem 54: 4172-86 (2011)
Article DOI: 10.1021/jm200274d
BindingDB Entry DOI: 10.7270/Q27D2VHR
Dual specificity protein kinase CLK3
(Mus musculus)
BDBM50347769
(CHEMBL1802852)
Show SMILES COCCNC1=NC(=Cc2ccc3OCOc3c2)C(=O)N1C |w:8.8,t:5|
Show InChI InChI=1S/C15H17N3O4/c1-18-14(19)11(17-15(18)16-5-6-20-2)7-10-3-4-12-13(8-10)22-9-21-12/h3-4,7-8H,5-6,9H2,1-2H3,(H,16,17)
n/an/a 3.10E+3n/an/an/an/an/an/a
Universite£? de Rennes 1
Curated by ChEMBL
Assay Description
Inhibition of mouse recombinant GST-tagged CLK3 using GRSRSRSRSRSR as substrate
J Med Chem 54: 4172-86 (2011)
Article DOI: 10.1021/jm200274d
BindingDB Entry DOI: 10.7270/Q27D2VHR
Cyclin-Dependent Kinase 5 (CDK5)
(Homo sapiens (Human))
BDBM50347769
(CHEMBL1802852)
Show SMILES COCCNC1=NC(=Cc2ccc3OCOc3c2)C(=O)N1C |w:8.8,t:5|
Show InChI InChI=1S/C15H17N3O4/c1-18-14(19)11(17-15(18)16-5-6-20-2)7-10-3-4-12-13(8-10)22-9-21-12/h3-4,7-8H,5-6,9H2,1-2H3,(H,16,17)
NCI pathway
Reactome pathway
n/an/a>1.00E+5n/an/an/an/an/an/a
Universite£? de Rennes 1
Curated by ChEMBL
Assay Description
Inhibition of human recombinant CDK5/p25
J Med Chem 54: 4172-86 (2011)
Article DOI: 10.1021/jm200274d
BindingDB Entry DOI: 10.7270/Q27D2VHR
Dual-specificity tyrosine-(Y)-phosphorylation regulated kinase 1A
(RAT)
BDBM50347769
(CHEMBL1802852)
Show SMILES COCCNC1=NC(=Cc2ccc3OCOc3c2)C(=O)N1C |w:8.8,t:5|
Show InChI InChI=1S/C15H17N3O4/c1-18-14(19)11(17-15(18)16-5-6-20-2)7-10-3-4-12-13(8-10)22-9-21-12/h3-4,7-8H,5-6,9H2,1-2H3,(H,16,17)
n/an/a 570n/an/an/an/an/an/a
Universite£? de Rennes 1
Curated by ChEMBL
Assay Description
Inhibition of rat recombinant GST-tagged DYRK1A using KKISGRLSPIMTEQ as substrate and [gamma32]-ATP after 30 mins by scintillation counting
J Med Chem 54: 4172-86 (2011)
Article DOI: 10.1021/jm200274d
BindingDB Entry DOI: 10.7270/Q27D2VHR
Dual-specificity tyrosine-phosphorylation regulated kinase 2
(Homo sapiens (Human))
BDBM50347769
(CHEMBL1802852)
Show SMILES COCCNC1=NC(=Cc2ccc3OCOc3c2)C(=O)N1C |w:8.8,t:5|
Show InChI InChI=1S/C15H17N3O4/c1-18-14(19)11(17-15(18)16-5-6-20-2)7-10-3-4-12-13(8-10)22-9-21-12/h3-4,7-8H,5-6,9H2,1-2H3,(H,16,17)
NCI pathway
n/an/a 770n/an/an/an/an/an/a
Universite£? de Rennes 1
Curated by ChEMBL
Assay Description
Inhibition of human recombinant GST-tagged DYRK2 using KKISGRLSPIMTEQ as substrate and [gamma32]-ATP after 30 mins by scintillation counting
J Med Chem 54: 4172-86 (2011)
Article DOI: 10.1021/jm200274d
BindingDB Entry DOI: 10.7270/Q27D2VHR
Serine/threonine-protein kinase pim-1
(Homo sapiens (Human))
BDBM50347769
(CHEMBL1802852)
Show SMILES COCCNC1=NC(=Cc2ccc3OCOc3c2)C(=O)N1C |w:8.8,t:5|
Show InChI InChI=1S/C15H17N3O4/c1-18-14(19)11(17-15(18)16-5-6-20-2)7-10-3-4-12-13(8-10)22-9-21-12/h3-4,7-8H,5-6,9H2,1-2H3,(H,16,17)
n/an/a>1.00E+4n/an/an/an/an/an/a
Universite£? de Rennes 1
Curated by ChEMBL
Assay Description
Inhibition of human recombinant Pim1
J Med Chem 54: 4172-86 (2011)
Article DOI: 10.1021/jm200274d
BindingDB Entry DOI: 10.7270/Q27D2VHR