BDBM50348030 CHEMBL1800476
SMILES: COc1ccc(NCCC2(CCOC(C)(C)C2)c2ccccc2)cc1
InChI Key: InChIKey=DAIMPQROONYPRP-UHFFFAOYSA-N
Data: 1 IC50
Activity Spreadsheet -- Enzyme Inhibition Constant Data from BindingDB
Found 1 hit for monomerid = 50348030
Trg + Lig
Ki
nM
ΔG°
kcal/mole
IC50
nM
Kd
nM
EC50/IC50
nM
koff
s-1
kon
M-1s-1
pHTemp
°C
Isoprenylcysteine carboxyl methyltransferase
(Homo sapiens (Human))
BDBM50348030
(CHEMBL1800476)
Show SMILES COc1ccc(NCCC2(CCOC(C)(C)C2)c2ccccc2)cc1
Show InChI InChI=1S/C22H29NO2/c1-21(2)17-22(14-16-25-21,18-7-5-4-6-8-18)13-15-23-19-9-11-20(24-3)12-10-19/h4-12,23H,13-17H2,1-3H3
n/an/a 270n/an/an/an/an/an/a
Myrexis, Inc.
Curated by ChEMBL
Assay Description
Inhibition of human recombinant C-terminal His6-tagged ICMT assessed as methylation of N-acetyl-S-geranylgeranylcysteine using SAM as methyl donor su...
J Med Chem 54: 5031-47 (2011)
Article DOI: 10.1021/jm200249a
BindingDB Entry DOI: 10.7270/Q2XW4K49