BDBM50348041 CHEMBL1800488
SMILES: CC1(C)CC(CCNc2ccc(Cl)c(Cl)c2)(CCO1)c1ccccc1
InChI Key: InChIKey=ARQQRDFCJSUEJV-UHFFFAOYSA-N
Data: 1 IC50
Activity Spreadsheet -- Enzyme Inhibition Constant Data from BindingDB
Found 1 hit for monomerid = 50348041
Trg + Lig
Ki
nM
ΔG°
kcal/mole
IC50
nM
Kd
nM
EC50/IC50
nM
koff
s-1
kon
M-1s-1
pHTemp
°C
Isoprenylcysteine carboxyl methyltransferase
(Homo sapiens (Human))
BDBM50348041
(CHEMBL1800488)
Show SMILES CC1(C)CC(CCNc2ccc(Cl)c(Cl)c2)(CCO1)c1ccccc1
Show InChI InChI=1S/C21H25Cl2NO/c1-20(2)15-21(11-13-25-20,16-6-4-3-5-7-16)10-12-24-17-8-9-18(22)19(23)14-17/h3-9,14,24H,10-13,15H2,1-2H3
n/an/a 181n/an/an/an/an/an/a
Myrexis, Inc.
Curated by ChEMBL
Assay Description
Inhibition of human recombinant C-terminal His6-tagged ICMT assessed as methylation of N-acetyl-S-geranylgeranylcysteine using SAM as methyl donor su...
J Med Chem 54: 5031-47 (2011)
Article DOI: 10.1021/jm200249a
BindingDB Entry DOI: 10.7270/Q2XW4K49