BDBM50348074 CHEMBL1800522
SMILES: CC1(C)CC(CCNc2ccccc2)(CC(C)(C)O1)c1ccccc1
InChI Key: InChIKey=ZLFMQBZRZIATAG-UHFFFAOYSA-N
Data: 1 IC50
Activity Spreadsheet -- Enzyme Inhibition Constant Data from BindingDB
Found 1 hit for monomerid = 50348074
Trg + Lig
Ki
nM
ΔG°
kcal/mole
IC50
nM
Kd
nM
EC50/IC50
nM
koff
s-1
kon
M-1s-1
pHTemp
°C
Isoprenylcysteine carboxyl methyltransferase
(Homo sapiens (Human))
BDBM50348074
(CHEMBL1800522)
Show SMILES CC1(C)CC(CCNc2ccccc2)(CC(C)(C)O1)c1ccccc1
Show InChI InChI=1S/C23H31NO/c1-21(2)17-23(18-22(3,4)25-21,19-11-7-5-8-12-19)15-16-24-20-13-9-6-10-14-20/h5-14,24H,15-18H2,1-4H3
n/an/a 15n/an/an/an/an/an/a
Myrexis, Inc.
Curated by ChEMBL
Assay Description
Inhibition of human recombinant C-terminal His6-tagged ICMT assessed as methylation of N-acetyl-S-geranylgeranylcysteine using SAM as methyl donor su...
J Med Chem 54: 5031-47 (2011)
Article DOI: 10.1021/jm200249a
BindingDB Entry DOI: 10.7270/Q2XW4K49