BDBM50348128 CHEMBL1800175
SMILES: CCS(=O)(=O)c1ccc2n(CC3CC3)c(nc2c1)C1(C)CCCC1
InChI Key: InChIKey=LURAKQNBAVXOPJ-UHFFFAOYSA-N
Data: 1 EC50
Activity Spreadsheet -- Enzyme Inhibition Constant Data from BindingDB
Found 1 hit for monomerid = 50348128
Trg + Lig
Ki
nM
ΔG°
kcal/mole
IC50
nM
Kd
nM
EC50/IC50
nM
koff
s-1
kon
M-1s-1
pHTemp
°C
Cannabinoid receptor 2
(Homo sapiens (Human))
BDBM50348128
(CHEMBL1800175)
Show SMILES CCS(=O)(=O)c1ccc2n(CC3CC3)c(nc2c1)C1(C)CCCC1
Show InChI InChI=1S/C19H26N2O2S/c1-3-24(22,23)15-8-9-17-16(12-15)20-18(19(2)10-4-5-11-19)21(17)13-14-6-7-14/h8-9,12,14H,3-7,10-11,13H2,1-2H3
Reactome pathway
n/an/an/an/a 9.60n/an/an/an/a
Pfizer Inc.
Curated by ChEMBL
Assay Description
Agonist activity at human recombinant CB2 receptor expressed in CHO cells assessed as inhibition forskolin-induced cAMP release
Bioorg Med Chem Lett 21: 4284-7 (2011)
Article DOI: 10.1016/j.bmcl.2011.05.063
BindingDB Entry DOI: 10.7270/Q2959HXV