BDBM50348399 CHEMBL1800980
SMILES: COc1ccc(cc1)C(c1ccccc1)C(C)(C)C(=O)Nc1nccs1
InChI Key: InChIKey=PNQYBFZDYCCUAN-UHFFFAOYSA-N
Data: 1 KI  3 EC50
Activity Spreadsheet -- Enzyme Inhibition Constant Data from BindingDB
Found 4 hits for monomerid = 50348399
Trg + Lig
Ki
nM
ΔG°
kcal/mole
IC50
nM
Kd
nM
EC50/IC50
nM
koff
s-1
kon
M-1s-1
pHTemp
°C
Glucocorticoid receptor
(Homo sapiens (Human))
BDBM50348399
(CHEMBL1800980)
Show SMILES COc1ccc(cc1)C(c1ccccc1)C(C)(C)C(=O)Nc1nccs1
Show InChI InChI=1S/C21H22N2O2S/c1-21(2,19(24)23-20-22-13-14-26-20)18(15-7-5-4-6-8-15)16-9-11-17(25-3)12-10-16/h4-14,18H,1-3H3,(H,22,23,24)
5.70n/an/an/an/an/an/an/an/a
Bristol-Myers Squibb Company
Curated by ChEMBL
Assay Description
Displacement of GS-red from GRapha by fluorescence polarization assay
J Med Chem 53: 8241-51 (2010)
Article DOI: 10.1021/jm100957a
BindingDB Entry DOI: 10.7270/Q2HX1DPW
Glucocorticoid receptor
(Homo sapiens (Human))
BDBM50348399
(CHEMBL1800980)
Show SMILES COc1ccc(cc1)C(c1ccccc1)C(C)(C)C(=O)Nc1nccs1
Show InChI InChI=1S/C21H22N2O2S/c1-21(2,19(24)23-20-22-13-14-26-20)18(15-7-5-4-6-8-15)16-9-11-17(25-3)12-10-16/h4-14,18H,1-3H3,(H,22,23,24)
n/an/an/an/a>5.00E+3n/an/an/an/a
Bristol-Myers Squibb Company
Curated by ChEMBL
Assay Description
Transactivation activity at glucocorticoid receptor in human 13D3/Huh7 cells assessed as induction of tyrosine aminotransferase activity after 24 hrs
J Med Chem 53: 8241-51 (2010)
Article DOI: 10.1021/jm100957a
BindingDB Entry DOI: 10.7270/Q2HX1DPW
Glucocorticoid receptor
(Homo sapiens (Human))
BDBM50348399
(CHEMBL1800980)
Show SMILES COc1ccc(cc1)C(c1ccccc1)C(C)(C)C(=O)Nc1nccs1
Show InChI InChI=1S/C21H22N2O2S/c1-21(2,19(24)23-20-22-13-14-26-20)18(15-7-5-4-6-8-15)16-9-11-17(25-3)12-10-16/h4-14,18H,1-3H3,(H,22,23,24)
n/an/an/an/a>1.00E+4n/an/an/an/a
Bristol-Myers Squibb Company
Curated by ChEMBL
Assay Description
Transrepression activity of glucocorticoid receptor in human A549 cells expressing AP-1 assessed as inhibition of PMA-induced AP-1 activity by lucife...
J Med Chem 53: 8241-51 (2010)
Article DOI: 10.1021/jm100957a
BindingDB Entry DOI: 10.7270/Q2HX1DPW
Glucocorticoid receptor
(Homo sapiens (Human))
BDBM50348399
(CHEMBL1800980)
Show SMILES COc1ccc(cc1)C(c1ccccc1)C(C)(C)C(=O)Nc1nccs1
Show InChI InChI=1S/C21H22N2O2S/c1-21(2,19(24)23-20-22-13-14-26-20)18(15-7-5-4-6-8-15)16-9-11-17(25-3)12-10-16/h4-14,18H,1-3H3,(H,22,23,24)
n/an/an/an/a>1.00E+4n/an/an/an/a
Bristol-Myers Squibb Company
Curated by ChEMBL
Assay Description
Transactivation activity of glucocorticoid receptor ligand binding domain expressed in human NP-1 Hela cells co-expressing GAL4 DNA binding domain by...
J Med Chem 53: 8241-51 (2010)
Article DOI: 10.1021/jm100957a
BindingDB Entry DOI: 10.7270/Q2HX1DPW