null
SMILES: CCOc1ccc(cc1)-n1nc2c(nnc(C)c2c1C)N1CCC1
InChI Key: InChIKey=SZALVIJBUOXUFB-UHFFFAOYSA-N
Activity Spreadsheet -- Enzyme Inhibition Constant Data from BindingDB
Found 2 hits for monomerid = 50348457
Trg + Lig
Ki
nM
ΔG°
kcal/mole
IC50
nM
Kd
nM
EC50/IC50
nM
koff
s-1
kon
M-1s-1
pHTemp
°C
Voltage-dependent calcium channel subunit alpha-2/delta-2
(Homo sapiens (Human))
BDBM50348457
(CHEMBL1801207)
Show SMILES CCOc1ccc(cc1)-n1nc2c(nnc(C)c2c1C)N1CCC1
Show InChI InChI=1S/C18H21N5O/c1-4-24-15-8-6-14(7-9-15)23-13(3)16-12(2)19-20-18(17(16)21-23)22-10-5-11-22/h6-9H,4-5,10-11H2,1-3H3
n/an/a 59n/an/an/an/an/an/a
GlaxoSmithKline
Curated by ChEMBL
Assay Description
Binding affinity at voltage-gated calcium channel subunit alpha2delta2
Bioorg Med Chem Lett 20: 4683-8 (2010)
Article DOI: 10.1016/j.bmcl.2010.05.026
BindingDB Entry DOI: 10.7270/Q2GQ6Z3D
Voltage-dependent calcium channel subunit alpha-2/delta-1
(Homo sapiens (Human))
BDBM50348457
(CHEMBL1801207)
Show SMILES CCOc1ccc(cc1)-n1nc2c(nnc(C)c2c1C)N1CCC1
Show InChI InChI=1S/C18H21N5O/c1-4-24-15-8-6-14(7-9-15)23-13(3)16-12(2)19-20-18(17(16)21-23)22-10-5-11-22/h6-9H,4-5,10-11H2,1-3H3
n/an/a 1n/an/an/an/an/an/a
GlaxoSmithKline
Curated by ChEMBL
Assay Description
Binding affinity at voltage-gated calcium channel subunit alpha2delta1
Bioorg Med Chem Lett 20: 4683-8 (2010)
Article DOI: 10.1016/j.bmcl.2010.05.026
BindingDB Entry DOI: 10.7270/Q2GQ6Z3D