BDBM50348479 CHEMBL1801195
SMILES: COCCOc1cncc(c1)-c1cc2-c3[nH]c4CCNC(=O)c4c3CCc2cn1
InChI Key: InChIKey=LVZFXQCXIOECDX-UHFFFAOYSA-N
Data: 2 IC50
Activity Spreadsheet -- Enzyme Inhibition Constant Data from BindingDB
Found 2 hits for monomerid = 50348479
Trg + Lig
Ki
nM
ΔG°
kcal/mole
IC50
nM
Kd
nM
EC50/IC50
nM
koff
s-1
kon
M-1s-1
pHTemp
°C
MAP kinase-activated protein kinase 2
(Homo sapiens (Human))
BDBM50348479
(CHEMBL1801195)
Show SMILES COCCOc1cncc(c1)-c1cc2-c3[nH]c4CCNC(=O)c4c3CCc2cn1
Show InChI InChI=1S/C22H22N4O3/c1-28-6-7-29-15-8-14(10-23-12-15)19-9-17-13(11-25-19)2-3-16-20-18(26-21(16)17)4-5-24-22(20)27/h8-12,26H,2-7H2,1H3,(H,24,27)
NCI pathway
Reactome pathway
n/an/a 40n/an/an/an/an/an/a
Novartis Institutes for BioMedical Research
Curated by ChEMBL
Assay Description
Inhibition of human MK2 using biotinyl-AYSRALSRQLSSGVSEIRCOOH as substrate after 45 mins by FRET analysis
Bioorg Med Chem Lett 20: 4719-23 (2010)
Checked by Author
Article DOI: 10.1016/j.bmcl.2010.04.023
BindingDB Entry DOI: 10.7270/Q2BZ66C2
MAP kinase-activated protein kinase 2
(Homo sapiens (Human))
BDBM50348479
(CHEMBL1801195)
Show SMILES COCCOc1cncc(c1)-c1cc2-c3[nH]c4CCNC(=O)c4c3CCc2cn1
Show InChI InChI=1S/C22H22N4O3/c1-28-6-7-29-15-8-14(10-23-12-15)19-9-17-13(11-25-19)2-3-16-20-18(26-21(16)17)4-5-24-22(20)27/h8-12,26H,2-7H2,1H3,(H,24,27)
NCI pathway
Reactome pathway
n/an/a 1.70E+3n/an/an/an/an/an/a
Novartis Institutes for BioMedical Research
Curated by ChEMBL
Assay Description
Inhibition of MK2 mediated anisomycin-stimulated hsp27 phosphorylation in human THP-1 cells by fluorometric analysis
Bioorg Med Chem Lett 20: 4719-23 (2010)
Checked by Author
Article DOI: 10.1016/j.bmcl.2010.04.023
BindingDB Entry DOI: 10.7270/Q2BZ66C2