BDBM50348481 CHEMBL1801307
SMILES: CN1CC2(C1)CNC(=O)c1c3CCc4cnc(nc4-c3[nH]c21)-c1ccc(F)nc1
InChI Key: InChIKey=WPSLEAFBLLIBPF-UHFFFAOYSA-N
Data: 2 IC50
Activity Spreadsheet -- Enzyme Inhibition Constant Data from BindingDB
Found 2 hits for monomerid = 50348481
Trg + Lig
Ki
nM
ΔG°
kcal/mole
IC50
nM
Kd
nM
EC50/IC50
nM
koff
s-1
kon
M-1s-1
pHTemp
°C
MAP kinase-activated protein kinase 2
(Homo sapiens (Human))
BDBM50348481
(CHEMBL1801307)
Show SMILES CN1CC2(C1)CNC(=O)c1c3CCc4cnc(nc4-c3[nH]c21)-c1ccc(F)nc1
Show InChI InChI=1S/C21H19FN6O/c1-28-9-21(10-28)8-25-20(29)15-13-4-2-11-6-24-19(12-3-5-14(22)23-7-12)27-16(11)17(13)26-18(15)21/h3,5-7,26H,2,4,8-10H2,1H3,(H,25,29)
NCI pathway
Reactome pathway
n/an/a 7n/an/an/an/an/an/a
Novartis Institutes for BioMedical Research
Curated by ChEMBL
Assay Description
Inhibition of human MK2 using biotinyl-AYSRALSRQLSSGVSEIRCOOH as substrate after 45 mins by FRET analysis
Bioorg Med Chem Lett 20: 4719-23 (2010)
Checked by Author
Article DOI: 10.1016/j.bmcl.2010.04.023
BindingDB Entry DOI: 10.7270/Q2BZ66C2
MAP kinase-activated protein kinase 2
(Homo sapiens (Human))
BDBM50348481
(CHEMBL1801307)
Show SMILES CN1CC2(C1)CNC(=O)c1c3CCc4cnc(nc4-c3[nH]c21)-c1ccc(F)nc1
Show InChI InChI=1S/C21H19FN6O/c1-28-9-21(10-28)8-25-20(29)15-13-4-2-11-6-24-19(12-3-5-14(22)23-7-12)27-16(11)17(13)26-18(15)21/h3,5-7,26H,2,4,8-10H2,1H3,(H,25,29)
NCI pathway
Reactome pathway
n/an/a 1.80E+3n/an/an/an/an/an/a
Novartis Institutes for BioMedical Research
Curated by ChEMBL
Assay Description
Inhibition of MK2 mediated anisomycin-stimulated hsp27 phosphorylation in human THP-1 cells by fluorometric analysis
Bioorg Med Chem Lett 20: 4719-23 (2010)
Checked by Author
Article DOI: 10.1016/j.bmcl.2010.04.023
BindingDB Entry DOI: 10.7270/Q2BZ66C2