null
SMILES: Fc1ccccc1-c1cc2-c3[nH]c4c(c3CCc2cn1)C(=O)NCC41CNC1
InChI Key: InChIKey=QMNKSAQTHXFFCG-UHFFFAOYSA-N
Activity Spreadsheet -- Enzyme Inhibition Constant Data from BindingDB
Found 2 hits for monomerid = 50348496
Trg + Lig
Ki
nM
ΔG°
kcal/mole
IC50
nM
Kd
nM
EC50/IC50
nM
koff
s-1
kon
M-1s-1
pHTemp
°C
MAP kinase-activated protein kinase 2
(Homo sapiens (Human))
BDBM50348496
(CHEMBL1801284)
Show SMILES Fc1ccccc1-c1cc2-c3[nH]c4c(c3CCc2cn1)C(=O)NCC41CNC1
Show InChI InChI=1S/C22H19FN4O/c23-16-4-2-1-3-13(16)17-7-15-12(8-25-17)5-6-14-18-20(27-19(14)15)22(9-24-10-22)11-26-21(18)28/h1-4,7-8,24,27H,5-6,9-11H2,(H,26,28)
NCI pathway
Reactome pathway
n/an/a 100n/an/an/an/an/an/a
Novartis Institutes for BioMedical Research
Curated by ChEMBL
Assay Description
Inhibition of MK2 mediated anisomycin-stimulated hsp27 phosphorylation in human THP-1 cells by fluorometric analysis
Bioorg Med Chem Lett 20: 4719-23 (2010)
Checked by Author
Article DOI: 10.1016/j.bmcl.2010.04.023
BindingDB Entry DOI: 10.7270/Q2BZ66C2
MAP kinase-activated protein kinase 2
(Homo sapiens (Human))
BDBM50348496
(CHEMBL1801284)
Show SMILES Fc1ccccc1-c1cc2-c3[nH]c4c(c3CCc2cn1)C(=O)NCC41CNC1
Show InChI InChI=1S/C22H19FN4O/c23-16-4-2-1-3-13(16)17-7-15-12(8-25-17)5-6-14-18-20(27-19(14)15)22(9-24-10-22)11-26-21(18)28/h1-4,7-8,24,27H,5-6,9-11H2,(H,26,28)
NCI pathway
Reactome pathway
n/an/a 17n/an/an/an/an/an/a
Novartis Institutes for BioMedical Research
Curated by ChEMBL
Assay Description
Inhibition of human MK2 using biotinyl-AYSRALSRQLSSGVSEIRCOOH as substrate after 45 mins by FRET analysis
Bioorg Med Chem Lett 20: 4719-23 (2010)
Checked by Author
Article DOI: 10.1016/j.bmcl.2010.04.023
BindingDB Entry DOI: 10.7270/Q2BZ66C2