BDBM50348546 CHEMBL1801385
SMILES: O=C1NCCc2[nH]c3c(ccc4cnc(\C=C\c5cccc(CCN6CCOCC6)c5)cc34)c12
InChI Key: InChIKey=UQQRUYAIZCVJMP-GQCTYLIASA-N
Data: 2 IC50
Activity Spreadsheet -- Enzyme Inhibition Constant Data from BindingDB
Found 2 hits for monomerid = 50348546
Trg + Lig
Ki
nM
ΔG°
kcal/mole
IC50
nM
Kd
nM
EC50/IC50
nM
koff
s-1
kon
M-1s-1
pHTemp
°C
Mitogen-activated protein kinase 9
(Homo sapiens (Human))
BDBM50348546
(CHEMBL1801385)
Show SMILES O=C1NCCc2[nH]c3c(ccc4cnc(\C=C\c5cccc(CCN6CCOCC6)c5)cc34)c12
Show InChI InChI=1S/C28H28N4O2/c33-28-26-23-7-5-21-18-30-22(17-24(21)27(23)31-25(26)8-10-29-28)6-4-19-2-1-3-20(16-19)9-11-32-12-14-34-15-13-32/h1-7,16-18,31H,8-15H2,(H,29,33)/b6-4+
NCI pathway
Reactome pathway
n/an/a 76n/an/an/an/an/an/a
Novartis Institutes for BioMedical Research
Curated by ChEMBL
Assay Description
Inhibition of JNK2
Bioorg Med Chem Lett 20: 4715-8 (2010)
Article DOI: 10.1016/j.bmcl.2010.04.024
BindingDB Entry DOI: 10.7270/Q2765FNN
MAP kinase-activated protein kinase 2
(Homo sapiens (Human))
BDBM50348546
(CHEMBL1801385)
Show SMILES O=C1NCCc2[nH]c3c(ccc4cnc(\C=C\c5cccc(CCN6CCOCC6)c5)cc34)c12
Show InChI InChI=1S/C28H28N4O2/c33-28-26-23-7-5-21-18-30-22(17-24(21)27(23)31-25(26)8-10-29-28)6-4-19-2-1-3-20(16-19)9-11-32-12-14-34-15-13-32/h1-7,16-18,31H,8-15H2,(H,29,33)/b6-4+
NCI pathway
Reactome pathway
n/an/a 5n/an/an/an/an/an/a
Novartis Institutes for BioMedical Research
Curated by ChEMBL
Assay Description
Inhibition of human MK2 using hsp27 peptide biotinyl-AYSRALSRQLSSGVSEIRCOOH as substrate after 45 mins by FRET assay
Bioorg Med Chem Lett 20: 4715-8 (2010)
Article DOI: 10.1016/j.bmcl.2010.04.024
BindingDB Entry DOI: 10.7270/Q2765FNN