BDBM50348588 CHEMBL1801269
SMILES: Brc1ccc(cc1)C1(Cc2cccnc2)c2ccccc2-c2nccn12
InChI Key: InChIKey=YUWLXYWIQFMMGU-UHFFFAOYSA-N
Data: 1 IC50
Activity Spreadsheet -- Enzyme Inhibition Constant Data from BindingDB
Found 1 hit for monomerid = 50348588
Trg + Lig
Ki
nM
ΔG°
kcal/mole
IC50
nM
Kd
nM
EC50/IC50
nM
koff
s-1
kon
M-1s-1
pHTemp
°C
Neuropeptide S receptor
(Homo sapiens (Human))
BDBM50348588
(CHEMBL1801269)
Show SMILES Brc1ccc(cc1)C1(Cc2cccnc2)c2ccccc2-c2nccn12
Show InChI InChI=1S/C22H16BrN3/c23-18-9-7-17(8-10-18)22(14-16-4-3-11-24-15-16)20-6-2-1-5-19(20)21-25-12-13-26(21)22/h1-13,15H,14H2
Reactome pathway
n/an/a 351n/an/an/an/an/an/a
Merck Research Laboratories
Curated by ChEMBL
Assay Description
Antagonist activity at human recombinant NPS receptor expressed in CHOK1 cells assessed as inhibition of NPS-induced calcium mobilization by FLIPR as...
Bioorg Med Chem Lett 20: 4704-8 (2010)
Article DOI: 10.1016/j.bmcl.2010.04.016
BindingDB Entry DOI: 10.7270/Q2ZS2WVZ