BDBM50348595 CHEMBL1801320
SMILES: Cc1ccc(cc1)C1(Cc2ccccc2)c2ccccc2-c2nccn12
InChI Key: InChIKey=WQURFRHDPQQANU-UHFFFAOYSA-N
Data: 1 IC50
Activity Spreadsheet -- Enzyme Inhibition Constant Data from BindingDB
Found 1 hit for monomerid = 50348595
Trg + Lig
Ki
nM
ΔG°
kcal/mole
IC50
nM
Kd
nM
EC50/IC50
nM
koff
s-1
kon
M-1s-1
pHTemp
°C
Neuropeptide S receptor
(Homo sapiens (Human))
BDBM50348595
(CHEMBL1801320)
Show SMILES Cc1ccc(cc1)C1(Cc2ccccc2)c2ccccc2-c2nccn12
Show InChI InChI=1S/C24H20N2/c1-18-11-13-20(14-12-18)24(17-19-7-3-2-4-8-19)22-10-6-5-9-21(22)23-25-15-16-26(23)24/h2-16H,17H2,1H3
Reactome pathway
n/an/a 1.33E+3n/an/an/an/an/an/a
Merck Research Laboratories
Curated by ChEMBL
Assay Description
Antagonist activity at human recombinant NPS receptor expressed in CHOK1 cells assessed as inhibition of NPS-induced calcium mobilization by FLIPR as...
Bioorg Med Chem Lett 20: 4704-8 (2010)
Article DOI: 10.1016/j.bmcl.2010.04.016
BindingDB Entry DOI: 10.7270/Q2ZS2WVZ