BDBM50348598 CHEMBL1801323
SMILES: N#Cc1cccc(c1)C1(Cc2ccccc2)c2ccccc2-c2nccn12
InChI Key: InChIKey=BXTNFBLUOIHDMG-UHFFFAOYSA-N
Data: 1 IC50
Activity Spreadsheet -- Enzyme Inhibition Constant Data from BindingDB
Found 1 hit for monomerid = 50348598
Trg + Lig
Ki
nM
ΔG°
kcal/mole
IC50
nM
Kd
nM
EC50/IC50
nM
koff
s-1
kon
M-1s-1
pHTemp
°C
Neuropeptide S receptor
(Homo sapiens (Human))
BDBM50348598
(CHEMBL1801323)
Show SMILES N#Cc1cccc(c1)C1(Cc2ccccc2)c2ccccc2-c2nccn12
Show InChI InChI=1S/C24H17N3/c25-17-19-9-6-10-20(15-19)24(16-18-7-2-1-3-8-18)22-12-5-4-11-21(22)23-26-13-14-27(23)24/h1-15H,16H2
Reactome pathway
n/an/a 3.17E+3n/an/an/an/an/an/a
Merck Research Laboratories
Curated by ChEMBL
Assay Description
Antagonist activity at human recombinant NPS receptor expressed in CHOK1 cells assessed as inhibition of NPS-induced calcium mobilization by FLIPR as...
Bioorg Med Chem Lett 20: 4704-8 (2010)
Article DOI: 10.1016/j.bmcl.2010.04.016
BindingDB Entry DOI: 10.7270/Q2ZS2WVZ