BDBM50348604 CHEMBL1801328
SMILES: Brc1ccc(cn1)C1(CC2CCCC2)c2ccccc2-c2nccn12
InChI Key: InChIKey=CCURDBOJGLDCJF-UHFFFAOYSA-N
Data: 1 IC50
Activity Spreadsheet -- Enzyme Inhibition Constant Data from BindingDB
Found 1 hit for monomerid = 50348604
Trg + Lig
Ki
nM
ΔG°
kcal/mole
IC50
nM
Kd
nM
EC50/IC50
nM
koff
s-1
kon
M-1s-1
pHTemp
°C
Neuropeptide S receptor
(Homo sapiens (Human))
BDBM50348604
(CHEMBL1801328)
Show SMILES Brc1ccc(cn1)C1(CC2CCCC2)c2ccccc2-c2nccn12
Show InChI InChI=1S/C21H20BrN3/c22-19-10-9-16(14-24-19)21(13-15-5-1-2-6-15)18-8-4-3-7-17(18)20-23-11-12-25(20)21/h3-4,7-12,14-15H,1-2,5-6,13H2
Reactome pathway
n/an/a 851n/an/an/an/an/an/a
Merck Research Laboratories
Curated by ChEMBL
Assay Description
Antagonist activity at human recombinant NPS receptor expressed in CHOK1 cells assessed as inhibition of NPS-induced calcium mobilization by FLIPR as...
Bioorg Med Chem Lett 20: 4704-8 (2010)
Article DOI: 10.1016/j.bmcl.2010.04.016
BindingDB Entry DOI: 10.7270/Q2ZS2WVZ