BDBM50348612 CHEMBL1801337
SMILES: CCN(CC)C(=O)CCC1(c2ccccc2-c2nccn12)c1ccc(Cl)cc1
InChI Key: InChIKey=GEFKGCGLIPFFLO-UHFFFAOYSA-N
Data: 1 IC50
Activity Spreadsheet -- Enzyme Inhibition Constant Data from BindingDB
Found 1 hit for monomerid = 50348612
Trg + Lig
Ki
nM
ΔG°
kcal/mole
IC50
nM
Kd
nM
EC50/IC50
nM
koff
s-1
kon
M-1s-1
pHTemp
°C
Neuropeptide S receptor
(Homo sapiens (Human))
BDBM50348612
(CHEMBL1801337)
Show SMILES CCN(CC)C(=O)CCC1(c2ccccc2-c2nccn12)c1ccc(Cl)cc1
Show InChI InChI=1S/C23H24ClN3O/c1-3-26(4-2)21(28)13-14-23(17-9-11-18(24)12-10-17)20-8-6-5-7-19(20)22-25-15-16-27(22)23/h5-12,15-16H,3-4,13-14H2,1-2H3
Reactome pathway
n/an/a 90n/an/an/an/an/an/a
Merck Research Laboratories
Curated by ChEMBL
Assay Description
Antagonist activity at human recombinant NPS receptor expressed in CHOK1 cells assessed as inhibition of NPS-induced calcium mobilization by FLIPR as...
Bioorg Med Chem Lett 20: 4704-8 (2010)
Article DOI: 10.1016/j.bmcl.2010.04.016
BindingDB Entry DOI: 10.7270/Q2ZS2WVZ