BDBM50348624 CHEMBL1801102
SMILES: Cn1cc(cn1)-c1cnc2c(Nc3cc(ns3)C3CCNCC3)nccn12
InChI Key: InChIKey=XLJHIFICPVNHJG-UHFFFAOYSA-N
Data: 2 IC50
Activity Spreadsheet -- Enzyme Inhibition Constant Data from BindingDB
Found 2 hits for monomerid = 50348624
Trg + Lig
Ki
nM
ΔG°
kcal/mole
IC50
nM
Kd
nM
EC50/IC50
nM
koff
s-1
kon
M-1s-1
pHTemp
°C
Aurora kinase A
(Homo sapiens (Human))
BDBM50348624
(CHEMBL1801102)
Show SMILES Cn1cc(cn1)-c1cnc2c(Nc3cc(ns3)C3CCNCC3)nccn12
Show InChI InChI=1S/C18H20N8S/c1-25-11-13(9-22-25)15-10-21-18-17(20-6-7-26(15)18)23-16-8-14(24-27-16)12-2-4-19-5-3-12/h6-12,19H,2-5H2,1H3,(H,20,23)
NCI pathway
Reactome pathway
n/an/a 1.60E+3n/an/an/an/an/an/a
Merck Research Laboratories
Curated by ChEMBL
Assay Description
Inhibition of aurora A kinase using 5TAMRA-GRTGRRNSICOOH as substrate by fluorescent assay
Bioorg Med Chem Lett 20: 5170-4 (2010)
Article DOI: 10.1016/j.bmcl.2010.07.008
BindingDB Entry DOI: 10.7270/Q2Q81DGH
Aurora kinase B
(Homo sapiens (Human))
BDBM50348624
(CHEMBL1801102)
Show SMILES Cn1cc(cn1)-c1cnc2c(Nc3cc(ns3)C3CCNCC3)nccn12
Show InChI InChI=1S/C18H20N8S/c1-25-11-13(9-22-25)15-10-21-18-17(20-6-7-26(15)18)23-16-8-14(24-27-16)12-2-4-19-5-3-12/h6-12,19H,2-5H2,1H3,(H,20,23)
Reactome pathway
n/an/a 200n/an/an/an/an/an/a
Merck Research Laboratories
Curated by ChEMBL
Assay Description
Inhibition of aurora B kinase using 5TAMRA-GRTGRRNSICOOH as substrate by fluorescent assay
Bioorg Med Chem Lett 20: 5170-4 (2010)
Article DOI: 10.1016/j.bmcl.2010.07.008
BindingDB Entry DOI: 10.7270/Q2Q81DGH