BDBM50348627 CHEMBL1801105
SMILES: Cc1csc(Nc2nccn3c(cnc23)-c2cnn(C)c2)n1
InChI Key: InChIKey=ZWPVXFBTTOJUSI-UHFFFAOYSA-N
Data: 1 IC50
Activity Spreadsheet -- Enzyme Inhibition Constant Data from BindingDB
Found 1 hit for monomerid = 50348627
Trg + Lig
Ki
nM
ΔG°
kcal/mole
IC50
nM
Kd
nM
EC50/IC50
nM
koff
s-1
kon
M-1s-1
pHTemp
°C
Aurora kinase A
(Homo sapiens (Human))
BDBM50348627
(CHEMBL1801105)
Show SMILES Cc1csc(Nc2nccn3c(cnc23)-c2cnn(C)c2)n1
Show InChI InChI=1S/C14H13N7S/c1-9-8-22-14(18-9)19-12-13-16-6-11(21(13)4-3-15-12)10-5-17-20(2)7-10/h3-8H,1-2H3,(H,15,18,19)
NCI pathway
Reactome pathway
n/an/a>1.00E+4n/an/an/an/an/an/a
Merck Research Laboratories
Curated by ChEMBL
Assay Description
Inhibition of aurora A kinase using 5TAMRA-GRTGRRNSICOOH as substrate by fluorescent assay
Bioorg Med Chem Lett 20: 5170-4 (2010)
Article DOI: 10.1016/j.bmcl.2010.07.008
BindingDB Entry DOI: 10.7270/Q2Q81DGH