BDBM50348646 CHEMBL1801398
SMILES: CN1CCC(CC1)(C(=O)NO)S(=O)(=O)c1ccc(Oc2ccc(OC(F)(F)F)cc2)cc1
InChI Key: InChIKey=QURZZKPWFKUXBF-UHFFFAOYSA-N
Data: 5 IC50
Activity Spreadsheet -- Enzyme Inhibition Constant Data from BindingDB
Found 5 hits for monomerid = 50348646
Trg + Lig
Ki
nM
ΔG°
kcal/mole
IC50
nM
Kd
nM
EC50/IC50
nM
koff
s-1
kon
M-1s-1
pHTemp
°C
Matrix metalloproteinase-9
(Homo sapiens (Human))
BDBM50348646
(CHEMBL1801398)
Show SMILES CN1CCC(CC1)(C(=O)NO)S(=O)(=O)c1ccc(Oc2ccc(OC(F)(F)F)cc2)cc1
Show InChI InChI=1S/C20H21F3N2O6S/c1-25-12-10-19(11-13-25,18(26)24-27)32(28,29)17-8-6-15(7-9-17)30-14-2-4-16(5-3-14)31-20(21,22)23/h2-9,27H,10-13H2,1H3,(H,24,26)
Reactome pathway
n/an/a 0.180n/an/an/an/an/an/a
Pfizer Inc.
Curated by ChEMBL
Assay Description
Inhibition of human MMP9 assessed as cleavage of fluorogenic peptide MCAPro-Leu-Gly-Leu-Dpa-Ala-Arg-NH2 by fluorometric assay
J Med Chem 53: 6653-80 (2010)
Article DOI: 10.1021/jm100669j
BindingDB Entry DOI: 10.7270/Q2KH0NQB
72 kDa type IV collagenase
(Homo sapiens (Human))
BDBM50348646
(CHEMBL1801398)
Show SMILES CN1CCC(CC1)(C(=O)NO)S(=O)(=O)c1ccc(Oc2ccc(OC(F)(F)F)cc2)cc1
Show InChI InChI=1S/C20H21F3N2O6S/c1-25-12-10-19(11-13-25,18(26)24-27)32(28,29)17-8-6-15(7-9-17)30-14-2-4-16(5-3-14)31-20(21,22)23/h2-9,27H,10-13H2,1H3,(H,24,26)
Reactome pathway
n/an/a<0.100n/an/an/an/an/an/a
Pfizer Inc.
Curated by ChEMBL
Assay Description
Inhibition of human MMP2 assessed as cleavage of fluorogenic peptide MCAPro-Leu-Gly-Leu-Dpa-Ala-Arg-NH2 by fluorometric assay
J Med Chem 53: 6653-80 (2010)
Article DOI: 10.1021/jm100669j
BindingDB Entry DOI: 10.7270/Q2KH0NQB
Collagenase 3
(Homo sapiens (Human))
BDBM50348646
(CHEMBL1801398)
Show SMILES CN1CCC(CC1)(C(=O)NO)S(=O)(=O)c1ccc(Oc2ccc(OC(F)(F)F)cc2)cc1
Show InChI InChI=1S/C20H21F3N2O6S/c1-25-12-10-19(11-13-25,18(26)24-27)32(28,29)17-8-6-15(7-9-17)30-14-2-4-16(5-3-14)31-20(21,22)23/h2-9,27H,10-13H2,1H3,(H,24,26)
NCI pathway
Reactome pathway
n/an/a 0.600n/an/an/an/an/an/a
Pfizer Inc.
Curated by ChEMBL
Assay Description
Inhibition of human MMP13 assessed as cleavage of fluorogenic peptide MCAPro-Leu-Gly-Leu-Dpa-Ala-Arg-NH2 by fluorometric assay
J Med Chem 53: 6653-80 (2010)
Article DOI: 10.1021/jm100669j
BindingDB Entry DOI: 10.7270/Q2KH0NQB
Interstitial collagenase
(Homo sapiens (Human))
BDBM50348646
(CHEMBL1801398)
Show SMILES CN1CCC(CC1)(C(=O)NO)S(=O)(=O)c1ccc(Oc2ccc(OC(F)(F)F)cc2)cc1
Show InChI InChI=1S/C20H21F3N2O6S/c1-25-12-10-19(11-13-25,18(26)24-27)32(28,29)17-8-6-15(7-9-17)30-14-2-4-16(5-3-14)31-20(21,22)23/h2-9,27H,10-13H2,1H3,(H,24,26)
Reactome pathway
n/an/a>1.00E+4n/an/an/an/an/an/a
Pfizer Inc.
Curated by ChEMBL
Assay Description
Inhibition of human MMP1 expressed in human HT-1080 cells assessed as cleavage of fluorogenic peptide MCAPro-Leu-Gly-Leu-Dpa-Ala-Arg-NH2 by fluoromet...
J Med Chem 53: 6653-80 (2010)
Article DOI: 10.1021/jm100669j
BindingDB Entry DOI: 10.7270/Q2KH0NQB
Matrix metalloproteinase-14 (MMP14)
(Homo sapiens (Human))
BDBM50348646
(CHEMBL1801398)
Show SMILES CN1CCC(CC1)(C(=O)NO)S(=O)(=O)c1ccc(Oc2ccc(OC(F)(F)F)cc2)cc1
Show InChI InChI=1S/C20H21F3N2O6S/c1-25-12-10-19(11-13-25,18(26)24-27)32(28,29)17-8-6-15(7-9-17)30-14-2-4-16(5-3-14)31-20(21,22)23/h2-9,27H,10-13H2,1H3,(H,24,26)
n/an/a 25n/an/an/an/an/an/a
Pfizer Inc.
Curated by ChEMBL
Assay Description
Inhibition of human MMP14 assessed as cleavage of fluorogenic peptide MCAPro-Leu-Gly-Leu-Dpa-Ala-Arg-NH2 by fluorometric assay
J Med Chem 53: 6653-80 (2010)
Article DOI: 10.1021/jm100669j
BindingDB Entry DOI: 10.7270/Q2KH0NQB